3 Replies Latest reply on Mar 23, 2015 4:35 PM by CMata_Intel

    How to rerun the kernel build after interruption due to power outage?

    veerendranth

      Hello,

       

           While I am building the kernel (using bitbake image-full-galileo) for galileo board due to power outage the process got terminated. whne I restart the process it's not proceeding due to below errors.

       

      Summary: 4 tasks failed:

        /home/veeru/bsp/meta-clanton_v1.0.1/poky/meta/recipes-devtools/gcc/libgcc_4.7.bb, do_compile

        virtual:native:/home/veeru/bsp/meta-clanton_v1.0.1/poky/meta/recipes-core/dbus/dbus-glib_0.100.2.bb, do_compile

        virtual:native:/home/veeru/bsp/meta-clanton_v1.0.1/poky/meta/recipes-devtools/python/python-pygobject_2.27.91.bb, do_compile

        /home/veeru/bsp/meta-clanton_v1.0.1/poky/meta/recipes-devtools/cdrtools/cdrtools-native_2.01.bb, do_install

      Summary: There were 4 ERROR messages shown, returning a non-zero exit code.

       

       

      Please tell me how start the process from terminated point. or should I start from beginning again?

       

      Regards,

      Veerendranath

        • 1. Re: How to rerun the kernel build after interruption due to power outage?
          xbolshe

          Because of power outage and your description I recommend you to restart a compiling process:

           

          bitbake -c clean image-full-galileo

          bitbake image-full-galileo

          • 2. Re: How to rerun the kernel build after interruption due to power outage?
            veerendranth

            Hello,

             

            Thanks for reply, I have tried given commands but it didn't resolve the issue... I am still facing the issue....

            Please check the complete error below......

             

            =============================================================================================

            ERROR: Function failed: do_compile (see /home/veeru/bsp/meta-clanton_v1.0.1/yocto_build/tmp/work/i586-poky-linux-uclibc/libgcc/4.7.2-r20/temp/log.do_compile.2166 for further information)

            ERROR: Logfile of failure stored in: /home/veeru/bsp/meta-clanton_v1.0.1/yocto_build/tmp/work/i586-poky-linux-uclibc/libgcc/4.7.2-r20/temp/log.do_compile.2166

            Log data follows:

            | DEBUG: SITE files ['endian-little', 'bit-32', 'ix86-common', 'common-linux', 'common-uclibc', 'i586-linux-uclibc', 'common']

            | DEBUG: Executing shell function do_compile

            | NOTE: make -j 14 MULTIBUILDTOP=/home/veeru/bsp/meta-clanton_v1.0.1/yocto_build/tmp/work/i586-poky-linux-uclibc/libgcc/4.7.2-r20/build/i586-poky-linux-uclibc/libgcc/

            | make: *** No targets.  Stop.

            | ERROR: oe_runmake failed

            | ERROR: Function failed: do_compile (see /home/veeru/bsp/meta-clanton_v1.0.1/yocto_build/tmp/work/i586-poky-linux-uclibc/libgcc/4.7.2-r20/temp/log.do_compile.2166 for further information)

            ERROR: Function failed: do_compile (see /home/veeru/bsp/meta-clanton_v1.0.1/yocto_build/tmp/work/i686-linux/dbus-glib-native/0.100.2-r0/temp/log.do_compile.2169 for further information)

            ERROR: Logfile of failure stored in: /home/veeru/bsp/meta-clanton_v1.0.1/yocto_build/tmp/work/i686-linux/dbus-glib-native/0.100.2-r0/temp/log.do_compile.2169

            Log data follows:

            | DEBUG: Executing shell function do_compile

            | NOTE: make -j 14

            | make  all-recursive

            | make[1]: Entering directory `/home/veeru/bsp/meta-clanton_v1.0.1/yocto_build/tmp/work/i686-linux/dbus-glib-native/0.100.2-r0/build'

            | Making all in dbus

            | make[2]: Entering directory `/home/veeru/bsp/meta-clanton_v1.0.1/yocto_build/tmp/work/i686-linux/dbus-glib-native/0.100.2-r0/build/dbus'

            | Making all in .

            | make[3]: Entering directory `/home/veeru/bsp/meta-clanton_v1.0.1/yocto_build/tmp/work/i686-linux/dbus-glib-native/0.100.2-r0/build/dbus'

            | ../i686-linux-libtool  --tag=CC   --mode=link gcc  -isystem/home/veeru/bsp/meta-clanton_v1.0.1/yocto_build/tmp/sysroots/i686-linux/usr/include -O2 -pipe -Wall -Wchar-subscripts -Wmissing-declarations -Wmissing-prototypes -Wnested-externs -Wpointer-arith -Wcast-align -Wfloat-equal -Wsign-compare -fno-strict-aliasing  -L/home/veeru/bsp/meta-clanton_v1.0.1/yocto_build/tmp/sysroots/i686-linux/usr/lib -L/home/veeru/bsp/meta-clanton_v1.0.1/yocto_build/tmp/sysroots/i686-linux/lib -Wl,-rpath-link,/home/veeru/bsp/meta-clanton_v1.0.1/yocto_build/tmp/sysroots/i686-linux/usr/lib -Wl,-rpath-link,/home/veeru/bsp/meta-clanton_v1.0.1/yocto_build/tmp/sysroots/i686-linux/lib -Wl,-rpath,/home/veeru/bsp/meta-clanton_v1.0.1/yocto_build/tmp/sysroots/i686-linux/usr/lib -Wl,-rpath,/home/veeru/bsp/meta-clanton_v1.0.1/yocto_build/tmp/sysroots/i686-linux/lib -Wl,-O1 -o dbus-binding-tool dbus-binding-tool-glib.o dbus-glib-tool.o ./libdbus-gtool.la ./libdbus-glib-1.la -L/home/veeru/bsp/meta-clanton_v1.0.1/yocto_build/tmp/sysroots/i686-linux/usr/lib -ldbus-1   -L/home/veeru/bsp/meta-clanton_v1.0.1/yocto_build/tmp/sysroots/i686-linux/usr/lib -lgio-2.0 -lgobject-2.0 -lglib-2.0   -lexpat

            | ../i686-linux-libtool  --tag=CC   --mode=link gcc  -isystem/home/veeru/bsp/meta-clanton_v1.0.1/yocto_build/tmp/sysroots/i686-linux/usr/include -O2 -pipe -Wall -Wchar-subscripts -Wmissing-declarations -Wmissing-prototypes -Wnested-externs -Wpointer-arith -Wcast-align -Wfloat-equal -Wsign-compare -fno-strict-aliasing  -L/home/veeru/bsp/meta-clanton_v1.0.1/yocto_build/tmp/sysroots/i686-linux/usr/lib -L/home/veeru/bsp/meta-clanton_v1.0.1/yocto_build/tmp/sysroots/i686-linux/lib -Wl,-rpath-link,/home/veeru/bsp/meta-clanton_v1.0.1/yocto_build/tmp/sysroots/i686-linux/usr/lib -Wl,-rpath-link,/home/veeru/bsp/meta-clanton_v1.0.1/yocto_build/tmp/sysroots/i686-linux/lib -Wl,-rpath,/home/veeru/bsp/meta-clanton_v1.0.1/yocto_build/tmp/sysroots/i686-linux/usr/lib -Wl,-rpath,/home/veeru/bsp/meta-clanton_v1.0.1/yocto_build/tmp/sysroots/i686-linux/lib -Wl,-O1 -o dbus-bash-completion-helper dbus-bash-completion-helper.o ./libdbus-gtool.la -lexpat ./libdbus-glib-1.la -L/home/veeru/bsp/meta-clanton_v1.0.1/yocto_build/tmp/sysroots/i686-linux/usr/lib -ldbus-1   -L/home/veeru/bsp/meta-clanton_v1.0.1/yocto_build/tmp/sysroots/i686-linux/usr/lib -lgio-2.0 -lgobject-2.0 -lglib-2.0

            | i686-linux-libtool: link: `./libdbus-gtool.la' is not a valid libtool archive

            | make[3]: *** [dbus-binding-tool] Error 1

            | make[3]: *** Waiting for unfinished jobs....

            | i686-linux-libtool: link: `./libdbus-gtool.la' is not a valid libtool archive

            | make[3]: *** [dbus-bash-completion-helper] Error 1

            | make[3]: Leaving directory `/home/veeru/bsp/meta-clanton_v1.0.1/yocto_build/tmp/work/i686-linux/dbus-glib-native/0.100.2-r0/build/dbus'

            | make[2]: *** [all-recursive] Error 1

            | make[2]: Leaving directory `/home/veeru/bsp/meta-clanton_v1.0.1/yocto_build/tmp/work/i686-linux/dbus-glib-native/0.100.2-r0/build/dbus'

            | make[1]: *** [all-recursive] Error 1

            | make[1]: Leaving directory `/home/veeru/bsp/meta-clanton_v1.0.1/yocto_build/tmp/work/i686-linux/dbus-glib-native/0.100.2-r0/build'

            | make: *** [all] Error 2

            | ERROR: oe_runmake failed

            | ERROR: Function failed: do_compile (see /home/veeru/bsp/meta-clanton_v1.0.1/yocto_build/tmp/work/i686-linux/dbus-glib-native/0.100.2-r0/temp/log.do_compile.2169 for further information)

            ERROR: Function failed: do_compile (see /home/veeru/bsp/meta-clanton_v1.0.1/yocto_build/tmp/work/i686-linux/python-pygobject-native/2.27.91-r6/temp/log.do_compile.2175 for further information)

            ERROR: Logfile of failure stored in: /home/veeru/bsp/meta-clanton_v1.0.1/yocto_build/tmp/work/i686-linux/python-pygobject-native/2.27.91-r6/temp/log.do_compile.2175

            Log data follows:

            | DEBUG: Executing shell function do_compile

            | NOTE: make -j 14

            | make: *** No targets.  Stop.

            | ERROR: oe_runmake failed

            | ERROR: Function failed: do_compile (see /home/veeru/bsp/meta-clanton_v1.0.1/yocto_build/tmp/work/i686-linux/python-pygobject-native/2.27.91-r6/temp/log.do_compile.2175 for further information)

            ERROR: Task 1270 (/home/veeru/bsp/meta-clanton_v1.0.1/poky/meta/recipes-devtools/gcc/libgcc_4.7.bb, do_compile) failed with exit code '1'

            ERROR: Task 2488 (virtual:native:/home/veeru/bsp/meta-clanton_v1.0.1/poky/meta/recipes-core/dbus/dbus-glib_0.100.2.bb, do_compile) failed with exit code '1'

            ERROR: Task 2527 (virtual:native:/home/veeru/bsp/meta-clanton_v1.0.1/poky/meta/recipes-devtools/python/python-pygobject_2.27.91.bb, do_compile) failed with exit code '1'

            ERROR: Function failed: do_install (see /home/veeru/bsp/meta-clanton_v1.0.1/yocto_build/tmp/work/i686-linux/cdrtools-native/2.01-r2/temp/log.do_install.2471 for further information)

            ERROR: Logfile of failure stored in: /home/veeru/bsp/meta-clanton_v1.0.1/yocto_build/tmp/work/i686-linux/cdrtools-native/2.01-r2/temp/log.do_install.2471

            Log data follows:

            | DEBUG: Executing shell function do_install

            | W A R N I N G Messages like:

            |

            | gmake[2]: Entering directory `/tmp/cdrtools-2.01/libschily'

            | ../RULES/r-gmake.dep:76: OBJ/<arch-dir>/cvmod.d: No such file or directory

            | ../RULES/r-gmake.dep:76: OBJ/<arch-dir>/dat.d: No such file or directory

            | ../RULES/r-gmake.dep:76: OBJ/<arch-dir>/fcons.d: No such file or directory

            | ../RULES/r-gmake.dep:76: OBJ/<arch-dir>/fdown.d: No such file or directory

            | ../RULES/r-gmake.dep:76: OBJ/<arch-dir>/fdup.d: No such file or directory

            | ../RULES/r-gmake.dep:76: OBJ/<arch-dir>/ffileread.d: No such file or directory

            | ../RULES/r-gmake.dep:76: OBJ/<arch-dir>/ffilewrite.d: No such file or directory

            | ../RULES/r-gmake.dep:76: OBJ/<arch-dir>/fgetline.d: No such file or directory

            | ../RULES/r-gmake.dep:76: OBJ/<arch-dir>/fgetstr.d: No such file or directory

            | ../RULES/r-gmake.dep:76: OBJ/<arch-dir>/file_raise.d: No such file or directory

            | ../RULES/r-gmake.dep:76: OBJ/<arch-dir>/fileclose.d: No such file or directory

            | ....

            |

            | are caused by a GNU make bug and not by the Schily makefile system.

            |

            | The related bug has been reported to the GNU make maintainers in 1988 but

            | as the bug has not yet been fixed, it seems that GNU make is unmaintained :-(

            | A working highly portable make program is at ftp://ftp.berlios.de/pub/smake

            | ==> MAKING "install" ON SUBDIRECTORY "SRCROOT/conf"

            | make[1]: Entering directory `/home/veeru/bsp/meta-clanton_v1.0.1/yocto_build/tmp/work/i686-linux/cdrtools-native/2.01-r2/cdrtools-2.01/conf'

            | install: nothing to make

            | make[1]: Leaving directory `/home/veeru/bsp/meta-clanton_v1.0.1/yocto_build/tmp/work/i686-linux/cdrtools-native/2.01-r2/cdrtools-2.01/conf'

            | ==> MAKING "install" ON SUBDIRECTORY "SRCROOT/inc"

            | make[1]: Entering directory `/home/veeru/bsp/meta-clanton_v1.0.1/yocto_build/tmp/work/i686-linux/cdrtools-native/2.01-r2/cdrtools-2.01/inc'

            | ==> MAKING "install" ON SUBCOMPONENT "SRCROOT/inc/align_test.mk"

            | make[2]: Entering directory `/home/veeru/bsp/meta-clanton_v1.0.1/yocto_build/tmp/work/i686-linux/cdrtools-native/2.01-r2/cdrtools-2.01/inc'

            | make[2]: Leaving directory `/home/veeru/bsp/meta-clanton_v1.0.1/yocto_build/tmp/work/i686-linux/cdrtools-native/2.01-r2/cdrtools-2.01/inc'

            | ==> MAKING "install" ON SUBCOMPONENT "SRCROOT/inc/avoffset.mk"

            | make[2]: Entering directory `/home/veeru/bsp/meta-clanton_v1.0.1/yocto_build/tmp/work/i686-linux/cdrtools-native/2.01-r2/cdrtools-2.01/inc'

            | make[2]: Leaving directory `/home/veeru/bsp/meta-clanton_v1.0.1/yocto_build/tmp/work/i686-linux/cdrtools-native/2.01-r2/cdrtools-2.01/inc'

            | make[1]: Leaving directory `/home/veeru/bsp/meta-clanton_v1.0.1/yocto_build/tmp/work/i686-linux/cdrtools-native/2.01-r2/cdrtools-2.01/inc'

            | ==> MAKING "install" ON SUBDIRECTORY "SRCROOT/lib"

            | NOTICE: Partial source (SRCROOT/lib) missing

            | ==> MAKING "install" ON SUBDIRECTORY "SRCROOT/libdeflt"

            | make[1]: Entering directory `/home/veeru/bsp/meta-clanton_v1.0.1/yocto_build/tmp/work/i686-linux/cdrtools-native/2.01-r2/cdrtools-2.01/libdeflt'

            | ==> MAKING "install" ON SUBCOMPONENT "SRCROOT/libdeflt/libdeflt.mk"

            | make[2]: Entering directory `/home/veeru/bsp/meta-clanton_v1.0.1/yocto_build/tmp/work/i686-linux/cdrtools-native/2.01-r2/cdrtools-2.01/libdeflt'

            | make[2]: Leaving directory `/home/veeru/bsp/meta-clanton_v1.0.1/yocto_build/tmp/work/i686-linux/cdrtools-native/2.01-r2/cdrtools-2.01/libdeflt'

            | make[1]: Leaving directory `/home/veeru/bsp/meta-clanton_v1.0.1/yocto_build/tmp/work/i686-linux/cdrtools-native/2.01-r2/cdrtools-2.01/libdeflt'

            | ==> MAKING "install" ON SUBDIRECTORY "SRCROOT/libedc"

            | make[1]: Entering directory `/home/veeru/bsp/meta-clanton_v1.0.1/yocto_build/tmp/work/i686-linux/cdrtools-native/2.01-r2/cdrtools-2.01/libedc'

            | ==> MAKING "install" ON SUBCOMPONENT "SRCROOT/libedc/libedc.mk"

            | make[2]: Entering directory `/home/veeru/bsp/meta-clanton_v1.0.1/yocto_build/tmp/work/i686-linux/cdrtools-native/2.01-r2/cdrtools-2.01/libedc'

            | make[2]: Leaving directory `/home/veeru/bsp/meta-clanton_v1.0.1/yocto_build/tmp/work/i686-linux/cdrtools-native/2.01-r2/cdrtools-2.01/libedc'

            | make[1]: Leaving directory `/home/veeru/bsp/meta-clanton_v1.0.1/yocto_build/tmp/work/i686-linux/cdrtools-native/2.01-r2/cdrtools-2.01/libedc'

            | ==> MAKING "install" ON SUBDIRECTORY "SRCROOT/libfile"

            | make[1]: Entering directory `/home/veeru/bsp/meta-clanton_v1.0.1/yocto_build/tmp/work/i686-linux/cdrtools-native/2.01-r2/cdrtools-2.01/libfile'

            | NOTICE: Partial source (SRCROOT/libfile/Makefile.man) missing

            | make[1]: Leaving directory `/home/veeru/bsp/meta-clanton_v1.0.1/yocto_build/tmp/work/i686-linux/cdrtools-native/2.01-r2/cdrtools-2.01/libfile'

            | ==> MAKING "install" ON SUBDIRECTORY "SRCROOT/libhfs_iso"

            | make[1]: Entering directory `/home/veeru/bsp/meta-clanton_v1.0.1/yocto_build/tmp/work/i686-linux/cdrtools-native/2.01-r2/cdrtools-2.01/libhfs_iso'

            | NOTICE: Partial source (SRCROOT/libhfs_iso/Makefile.man) missing

            | make[1]: Leaving directory `/home/veeru/bsp/meta-clanton_v1.0.1/yocto_build/tmp/work/i686-linux/cdrtools-native/2.01-r2/cdrtools-2.01/libhfs_iso'

            | ==> MAKING "install" ON SUBDIRECTORY "SRCROOT/libparanoia"

            | make[1]: Entering directory `/home/veeru/bsp/meta-clanton_v1.0.1/yocto_build/tmp/work/i686-linux/cdrtools-native/2.01-r2/cdrtools-2.01/libparanoia'

            | ==> MAKING "install" ON SUBCOMPONENT "SRCROOT/libparanoia/paranoia.mk"

            | make[2]: Entering directory `/home/veeru/bsp/meta-clanton_v1.0.1/yocto_build/tmp/work/i686-linux/cdrtools-native/2.01-r2/cdrtools-2.01/libparanoia'

            | make[2]: Leaving directory `/home/veeru/bsp/meta-clanton_v1.0.1/yocto_build/tmp/work/i686-linux/cdrtools-native/2.01-r2/cdrtools-2.01/libparanoia'

            | make[1]: Leaving directory `/home/veeru/bsp/meta-clanton_v1.0.1/yocto_build/tmp/work/i686-linux/cdrtools-native/2.01-r2/cdrtools-2.01/libparanoia'

            | ==> MAKING "install" ON SUBDIRECTORY "SRCROOT/librscg"

            | make[1]: Entering directory `/home/veeru/bsp/meta-clanton_v1.0.1/yocto_build/tmp/work/i686-linux/cdrtools-native/2.01-r2/cdrtools-2.01/librscg'

            | ==> MAKING "install" ON SUBCOMPONENT "SRCROOT/librscg/librscg.mk"

            | make[2]: Entering directory `/home/veeru/bsp/meta-clanton_v1.0.1/yocto_build/tmp/work/i686-linux/cdrtools-native/2.01-r2/cdrtools-2.01/librscg'

            | make[2]: Leaving directory `/home/veeru/bsp/meta-clanton_v1.0.1/yocto_build/tmp/work/i686-linux/cdrtools-native/2.01-r2/cdrtools-2.01/librscg'

            | make[1]: Leaving directory `/home/veeru/bsp/meta-clanton_v1.0.1/yocto_build/tmp/work/i686-linux/cdrtools-native/2.01-r2/cdrtools-2.01/librscg'

            | ==> MAKING "install" ON SUBDIRECTORY "SRCROOT/libscg"

            | make[1]: Entering directory `/home/veeru/bsp/meta-clanton_v1.0.1/yocto_build/tmp/work/i686-linux/cdrtools-native/2.01-r2/cdrtools-2.01/libscg'

            | ==> MAKING "install" ON SUBCOMPONENT "SRCROOT/libscg/libscg.mk"

            | make[2]: Entering directory `/home/veeru/bsp/meta-clanton_v1.0.1/yocto_build/tmp/work/i686-linux/cdrtools-native/2.01-r2/cdrtools-2.01/libscg'

            | make[2]: Leaving directory `/home/veeru/bsp/meta-clanton_v1.0.1/yocto_build/tmp/work/i686-linux/cdrtools-native/2.01-r2/cdrtools-2.01/libscg'

            | make[1]: Leaving directory `/home/veeru/bsp/meta-clanton_v1.0.1/yocto_build/tmp/work/i686-linux/cdrtools-native/2.01-r2/cdrtools-2.01/libscg'

            | ==> MAKING "install" ON SUBDIRECTORY "SRCROOT/libschily"

            | make[1]: Entering directory `/home/veeru/bsp/meta-clanton_v1.0.1/yocto_build/tmp/work/i686-linux/cdrtools-native/2.01-r2/cdrtools-2.01/libschily'

            | ==> MAKING "install" ON SUBCOMPONENT "SRCROOT/libschily/libschily.mk"

            | make[2]: Entering directory `/home/veeru/bsp/meta-clanton_v1.0.1/yocto_build/tmp/work/i686-linux/cdrtools-native/2.01-r2/cdrtools-2.01/libschily'

            | make[2]: Leaving directory `/home/veeru/bsp/meta-clanton_v1.0.1/yocto_build/tmp/work/i686-linux/cdrtools-native/2.01-r2/cdrtools-2.01/libschily'

            | make[1]: Leaving directory `/home/veeru/bsp/meta-clanton_v1.0.1/yocto_build/tmp/work/i686-linux/cdrtools-native/2.01-r2/cdrtools-2.01/libschily'

            | ==> MAKING "install" ON SUBDIRECTORY "SRCROOT/libunls"

            | make[1]: Entering directory `/home/veeru/bsp/meta-clanton_v1.0.1/yocto_build/tmp/work/i686-linux/cdrtools-native/2.01-r2/cdrtools-2.01/libunls'

            | ==> MAKING "install" ON SUBCOMPONENT "SRCROOT/libunls/libunls.mk"

            | make[2]: Entering directory `/home/veeru/bsp/meta-clanton_v1.0.1/yocto_build/tmp/work/i686-linux/cdrtools-native/2.01-r2/cdrtools-2.01/libunls'

            | make[2]: Leaving directory `/home/veeru/bsp/meta-clanton_v1.0.1/yocto_build/tmp/work/i686-linux/cdrtools-native/2.01-r2/cdrtools-2.01/libunls'

            | make[1]: Leaving directory `/home/veeru/bsp/meta-clanton_v1.0.1/yocto_build/tmp/work/i686-linux/cdrtools-native/2.01-r2/cdrtools-2.01/libunls'

            | ==> MAKING "install" ON SUBDIRECTORY "SRCROOT/cdda2wav"

            | make[1]: Entering directory `/home/veeru/bsp/meta-clanton_v1.0.1/yocto_build/tmp/work/i686-linux/cdrtools-native/2.01-r2/cdrtools-2.01/cdda2wav'

            | ==> LINKING "OBJ/i686-linux-cc/cdda2wav"

            | OBJ/i686-linux-cc/scsi_cdr.o: In function `read_cdtext':

            | scsi_cdr.c:(.text+0x265a): undefined reference to `fileopen'

            | ../libs/i686-linux-cc/libscg.a(scsitransp.o): In function `scg_yes':

            | scsitransp.c:(.text+0x22b): undefined reference to `getline_schily'

            | collect2: ld returned 1 exit status

            | make[1]: *** [OBJ/i686-linux-cc/cdda2wav] Error 1

            | make[1]: Leaving directory `/home/veeru/bsp/meta-clanton_v1.0.1/yocto_build/tmp/work/i686-linux/cdrtools-native/2.01-r2/cdrtools-2.01/cdda2wav'

            | ==> MAKING "install" ON SUBDIRECTORY "SRCROOT/cdrecord"

            | make[1]: Entering directory `/home/veeru/bsp/meta-clanton_v1.0.1/yocto_build/tmp/work/i686-linux/cdrtools-native/2.01-r2/cdrtools-2.01/cdrecord'

            | ==> COMPILING "OBJ/i686-linux-cc/cue.o"

            | cue.c:252:12: error: conflicting types for 'getdelim'

            | /usr/include/stdio.h:665:20: note: previous declaration of 'getdelim' was here

            | cue.c: In function 'cueabort':

            | cue.c:1252:3: warning: unknown conversion type character 'r' in format [-Wformat]

            | cue.c:1252:3: warning: format '%d' expects argument of type 'int', but argument 3 has type 'const char *' [-Wformat]

            | make[1]: *** [OBJ/i686-linux-cc/cue.o] Error 1

            | make[1]: Leaving directory `/home/veeru/bsp/meta-clanton_v1.0.1/yocto_build/tmp/work/i686-linux/cdrtools-native/2.01-r2/cdrtools-2.01/cdrecord'

            | ==> MAKING "install" ON SUBDIRECTORY "SRCROOT/cmd"

            | NOTICE: Partial source (SRCROOT/cmd) missing

            | ==> MAKING "install" ON SUBDIRECTORY "SRCROOT/mkisofs"

            | make[1]: Entering directory `/home/veeru/bsp/meta-clanton_v1.0.1/yocto_build/tmp/work/i686-linux/cdrtools-native/2.01-r2/cdrtools-2.01/mkisofs'

            | ==> LINKING "OBJ/i686-linux-cc/mkisofs"

            | ../libs/i686-linux-cc/libscg.a(scsitransp.o): In function `scg_yes':

            | scsitransp.c:(.text+0x22b): undefined reference to `getline_schily'

            | ../libs/i686-linux-cc/libschily.a(fileopen64.o): In function `fileopen64':

            | fileopen64.c:(.text+0x2b): undefined reference to `_cvmod'

            | collect2: ld returned 1 exit status

            | make[1]: *** [OBJ/i686-linux-cc/mkisofs] Error 1

            | make[1]: Leaving directory `/home/veeru/bsp/meta-clanton_v1.0.1/yocto_build/tmp/work/i686-linux/cdrtools-native/2.01-r2/cdrtools-2.01/mkisofs'

            | ==> MAKING "install" ON SUBDIRECTORY "SRCROOT/mkisofs/diag"

            | make[1]: Entering directory `/home/veeru/bsp/meta-clanton_v1.0.1/yocto_build/tmp/work/i686-linux/cdrtools-native/2.01-r2/cdrtools-2.01/mkisofs/diag'

            | ==> MAKING "install" ON SUBCOMPONENT "SRCROOT/mkisofs/diag/dump.mk"

            | make[2]: Entering directory `/home/veeru/bsp/meta-clanton_v1.0.1/yocto_build/tmp/work/i686-linux/cdrtools-native/2.01-r2/cdrtools-2.01/mkisofs/diag'

            | ==> LINKING "OBJ/i686-linux-cc/devdump"

            | ../../libs/i686-linux-cc/libscg.a(scsitransp.o): In function `scg_yes':

            | scsitransp.c:(.text+0x22b): undefined reference to `getline_schily'

            | ../../libs/i686-linux-cc/libschily.a(fileopen64.o): In function `fileopen64':

            | fileopen64.c:(.text+0x2b): undefined reference to `_cvmod'

            | collect2: ld returned 1 exit status

            | make[2]: *** [OBJ/i686-linux-cc/devdump] Error 1

            | make[2]: Leaving directory `/home/veeru/bsp/meta-clanton_v1.0.1/yocto_build/tmp/work/i686-linux/cdrtools-native/2.01-r2/cdrtools-2.01/mkisofs/diag'

            | ==> MAKING "install" ON SUBCOMPONENT "SRCROOT/mkisofs/diag/isodump.mk"

            | make[2]: Entering directory `/home/veeru/bsp/meta-clanton_v1.0.1/yocto_build/tmp/work/i686-linux/cdrtools-native/2.01-r2/cdrtools-2.01/mkisofs/diag'

            | ==> LINKING "OBJ/i686-linux-cc/isodump"

            | ../../libs/i686-linux-cc/libscg.a(scsitransp.o): In function `scg_yes':

            | scsitransp.c:(.text+0x22b): undefined reference to `getline_schily'

            | ../../libs/i686-linux-cc/libschily.a(fileopen64.o): In function `fileopen64':

            | fileopen64.c:(.text+0x2b): undefined reference to `_cvmod'

            | collect2: ld returned 1 exit status

            | make[2]: *** [OBJ/i686-linux-cc/isodump] Error 1

            | make[2]: Leaving directory `/home/veeru/bsp/meta-clanton_v1.0.1/yocto_build/tmp/work/i686-linux/cdrtools-native/2.01-r2/cdrtools-2.01/mkisofs/diag'

            | ==> MAKING "install" ON SUBCOMPONENT "SRCROOT/mkisofs/diag/isoinfo.mk"

            | make[2]: Entering directory `/home/veeru/bsp/meta-clanton_v1.0.1/yocto_build/tmp/work/i686-linux/cdrtools-native/2.01-r2/cdrtools-2.01/mkisofs/diag'

            | ==> LINKING "OBJ/i686-linux-cc/isoinfo"

            | ../../libs/i686-linux-cc/libscg.a(scsitransp.o): In function `scg_yes':

            | scsitransp.c:(.text+0x22b): undefined reference to `getline_schily'

            | ../../libs/i686-linux-cc/libschily.a(fileopen64.o): In function `fileopen64':

            | fileopen64.c:(.text+0x2b): undefined reference to `_cvmod'

            | collect2: ld returned 1 exit status

            | make[2]: *** [OBJ/i686-linux-cc/isoinfo] Error 1

            | make[2]: Leaving directory `/home/veeru/bsp/meta-clanton_v1.0.1/yocto_build/tmp/work/i686-linux/cdrtools-native/2.01-r2/cdrtools-2.01/mkisofs/diag'

            | ==> MAKING "install" ON SUBCOMPONENT "SRCROOT/mkisofs/diag/isovfy.mk"

            | make[2]: Entering directory `/home/veeru/bsp/meta-clanton_v1.0.1/yocto_build/tmp/work/i686-linux/cdrtools-native/2.01-r2/cdrtools-2.01/mkisofs/diag'

            | ==> LINKING "OBJ/i686-linux-cc/isovfy"

            | ../../libs/i686-linux-cc/libscg.a(scsitransp.o): In function `scg_yes':

            | scsitransp.c:(.text+0x22b): undefined reference to `getline_schily'

            | ../../libs/i686-linux-cc/libschily.a(fileopen64.o): In function `fileopen64':

            | fileopen64.c:(.text+0x2b): undefined reference to `_cvmod'

            | collect2: ld returned 1 exit status

            | make[2]: *** [OBJ/i686-linux-cc/isovfy] Error 1

            | make[2]: Leaving directory `/home/veeru/bsp/meta-clanton_v1.0.1/yocto_build/tmp/work/i686-linux/cdrtools-native/2.01-r2/cdrtools-2.01/mkisofs/diag'

            | ==> MAKING "install" ON SUBCOMPONENT "SRCROOT/mkisofs/diag/isodebug.mk"

            | make[2]: Entering directory `/home/veeru/bsp/meta-clanton_v1.0.1/yocto_build/tmp/work/i686-linux/cdrtools-native/2.01-r2/cdrtools-2.01/mkisofs/diag'

            | ==> LINKING "OBJ/i686-linux-cc/isodebug"

            | ../../libs/i686-linux-cc/libscg.a(scsitransp.o): In function `scg_yes':

            | scsitransp.c:(.text+0x22b): undefined reference to `getline_schily'

            | ../../libs/i686-linux-cc/libschily.a(fileopen64.o): In function `fileopen64':

            | fileopen64.c:(.text+0x2b): undefined reference to `_cvmod'

            | collect2: ld returned 1 exit status

            | make[2]: *** [OBJ/i686-linux-cc/isodebug] Error 1

            | make[2]: Leaving directory `/home/veeru/bsp/meta-clanton_v1.0.1/yocto_build/tmp/work/i686-linux/cdrtools-native/2.01-r2/cdrtools-2.01/mkisofs/diag'

            | make[1]: *** [install] Error 2

            | make[1]: Leaving directory `/home/veeru/bsp/meta-clanton_v1.0.1/yocto_build/tmp/work/i686-linux/cdrtools-native/2.01-r2/cdrtools-2.01/mkisofs/diag'

            | ==> MAKING "install" ON SUBDIRECTORY "SRCROOT/readcd"

            | make[1]: Entering directory `/home/veeru/bsp/meta-clanton_v1.0.1/yocto_build/tmp/work/i686-linux/cdrtools-native/2.01-r2/cdrtools-2.01/readcd'

            | ==> LINKING "OBJ/i686-linux-cc/readcd"

            | OBJ/i686-linux-cc/readcd.o: In function `read_generic':

            | readcd.c:(.text+0xfa3): undefined reference to `getline_schily'

            | OBJ/i686-linux-cc/readcd.o: In function `write_disk':

            | readcd.c:(.text+0x1b78): undefined reference to `getline_schily'

            | readcd.c:(.text+0x1d4f): undefined reference to `fileread'

            | OBJ/i686-linux-cc/io.o: In function `getvalue':

            | io.c:(.text+0x2e7): undefined reference to `getline_schily'

            | OBJ/i686-linux-cc/io.o: In function `yes':

            | io.c:(.text+0x42f): undefined reference to `getline_schily'

            | ../libs/i686-linux-cc/libscg.a(scsitransp.o): In function `scg_yes':

            | scsitransp.c:(.text+0x22b): undefined reference to `getline_schily'

            | ../libs/i686-linux-cc/libschily.a(fileopen64.o): In function `fileopen64':

            | fileopen64.c:(.text+0x2b): undefined reference to `_cvmod'

            | collect2: ld returned 1 exit status

            | make[1]: *** [OBJ/i686-linux-cc/readcd] Error 1

            | make[1]: Leaving directory `/home/veeru/bsp/meta-clanton_v1.0.1/yocto_build/tmp/work/i686-linux/cdrtools-native/2.01-r2/cdrtools-2.01/readcd'

            | ==> MAKING "install" ON SUBDIRECTORY "SRCROOT/rscsi"

            | make[1]: Entering directory `/home/veeru/bsp/meta-clanton_v1.0.1/yocto_build/tmp/work/i686-linux/cdrtools-native/2.01-r2/cdrtools-2.01/rscsi'

            | ==> LINKING "OBJ/i686-linux-cc/rscsi"

            | ../libs/i686-linux-cc/libscg.a(scsitransp.o): In function `scg_yes':

            | scsitransp.c:(.text+0x22b): undefined reference to `getline_schily'

            | collect2: ld returned 1 exit status

            | make[1]: *** [OBJ/i686-linux-cc/rscsi] Error 1

            | make[1]: Leaving directory `/home/veeru/bsp/meta-clanton_v1.0.1/yocto_build/tmp/work/i686-linux/cdrtools-native/2.01-r2/cdrtools-2.01/rscsi'

            | ==> MAKING "install" ON SUBDIRECTORY "SRCROOT/scgcheck"

            | make[1]: Entering directory `/home/veeru/bsp/meta-clanton_v1.0.1/yocto_build/tmp/work/i686-linux/cdrtools-native/2.01-r2/cdrtools-2.01/scgcheck'

            | ==> LINKING "OBJ/i686-linux-cc/scgcheck"

            | OBJ/i686-linux-cc/scgcheck.o: In function `main':

            | scgcheck.c:(.text+0x7f5): undefined reference to `fileopen'

            | scgcheck.c:(.text+0x9b2): undefined reference to `getline_schily'

            | scgcheck.c:(.text+0xbaa): undefined reference to `getline_schily'

            | scgcheck.c:(.text+0xc8b): undefined reference to `getline_schily'

            | scgcheck.c:(.text+0x10e5): undefined reference to `getline_schily'

            | OBJ/i686-linux-cc/sense.o: In function `sensetest':

            | sense.c:(.text+0x395): undefined reference to `getline_schily'

            | OBJ/i686-linux-cc/sense.o:sense.c:(.text+0x4a1): more undefined references to `getline_schily' follow

            | OBJ/i686-linux-cc/scsi_cdr.o: In function `read_cdtext':

            | scsi_cdr.c:(.text+0x265a): undefined reference to `fileopen'

            | ../libs/i686-linux-cc/libscg.a(scsitransp.o): In function `scg_yes':

            | scsitransp.c:(.text+0x22b): undefined reference to `getline_schily'

            | collect2: ld returned 1 exit status

            | make[1]: *** [OBJ/i686-linux-cc/scgcheck] Error 1

            | make[1]: Leaving directory `/home/veeru/bsp/meta-clanton_v1.0.1/yocto_build/tmp/work/i686-linux/cdrtools-native/2.01-r2/cdrtools-2.01/scgcheck'

            | ==> MAKING "install" ON SUBDIRECTORY "SRCROOT/scgskeleton"

            | make[1]: Entering directory `/home/veeru/bsp/meta-clanton_v1.0.1/yocto_build/tmp/work/i686-linux/cdrtools-native/2.01-r2/cdrtools-2.01/scgskeleton'

            | ==> LINKING "OBJ/i686-linux-cc/skel"

            | OBJ/i686-linux-cc/io.o: In function `getvalue':

            | io.c:(.text+0x2e7): undefined reference to `getline_schily'

            | OBJ/i686-linux-cc/io.o: In function `yes':

            | io.c:(.text+0x42f): undefined reference to `getline_schily'

            | ../libs/i686-linux-cc/libscg.a(scsitransp.o): In function `scg_yes':

            | scsitransp.c:(.text+0x22b): undefined reference to `getline_schily'

            | ../libs/i686-linux-cc/libschily.a(fileopen64.o): In function `fileopen64':

            | fileopen64.c:(.text+0x2b): undefined reference to `_cvmod'

            | collect2: ld returned 1 exit status

            | make[1]: *** [OBJ/i686-linux-cc/skel] Error 1

            | make[1]: Leaving directory `/home/veeru/bsp/meta-clanton_v1.0.1/yocto_build/tmp/work/i686-linux/cdrtools-native/2.01-r2/cdrtools-2.01/scgskeleton'

            | ==> MAKING "install" ON SUBDIRECTORY "SRCROOT/man"

            | make[1]: Entering directory `/home/veeru/bsp/meta-clanton_v1.0.1/yocto_build/tmp/work/i686-linux/cdrtools-native/2.01-r2/cdrtools-2.01/man'

            | ==> MAKING "install" ON SUBDIRECTORY "SRCROOT/man/man4"

            | make[2]: Entering directory `/home/veeru/bsp/meta-clanton_v1.0.1/yocto_build/tmp/work/i686-linux/cdrtools-native/2.01-r2/cdrtools-2.01/man/man4'

            | ==> MAKING "install" ON SUBCOMPONENT "SRCROOT/man/man4/makefiles.mk"

            | make[3]: Entering directory `/home/veeru/bsp/meta-clanton_v1.0.1/yocto_build/tmp/work/i686-linux/cdrtools-native/2.01-r2/cdrtools-2.01/man/man4'

            | make[3]: Leaving directory `/home/veeru/bsp/meta-clanton_v1.0.1/yocto_build/tmp/work/i686-linux/cdrtools-native/2.01-r2/cdrtools-2.01/man/man4'

            | ==> MAKING "install" ON SUBCOMPONENT "SRCROOT/man/man4/makerules.mk"

            | make[3]: Entering directory `/home/veeru/bsp/meta-clanton_v1.0.1/yocto_build/tmp/work/i686-linux/cdrtools-native/2.01-r2/cdrtools-2.01/man/man4'

            | make[3]: Leaving directory `/home/veeru/bsp/meta-clanton_v1.0.1/yocto_build/tmp/work/i686-linux/cdrtools-native/2.01-r2/cdrtools-2.01/man/man4'

            | make[2]: Leaving directory `/home/veeru/bsp/meta-clanton_v1.0.1/yocto_build/tmp/work/i686-linux/cdrtools-native/2.01-r2/cdrtools-2.01/man/man4'

            | make[1]: Leaving directory `/home/veeru/bsp/meta-clanton_v1.0.1/yocto_build/tmp/work/i686-linux/cdrtools-native/2.01-r2/cdrtools-2.01/man'

            | install: cannot stat `/home/veeru/bsp/meta-clanton_v1.0.1/yocto_build/tmp/work/i686-linux/cdrtools-native/2.01-r2/image-temp/bin/*': No such file or directory

            | ERROR: Function failed: do_install (see /home/veeru/bsp/meta-clanton_v1.0.1/yocto_build/tmp/work/i686-linux/cdrtools-native/2.01-r2/temp/log.do_install.2471 for further information)

            ERROR: Task 185 (/home/veeru/bsp/meta-clanton_v1.0.1/poky/meta/recipes-devtools/cdrtools/cdrtools-native_2.01.bb, do_install) failed with exit code '1'

            • 3. Re: How to rerun the kernel build after interruption due to power outage?
              CMata_Intel

              Hi veerendranth

               

              Which OS are you using?

              Have you tried to delete the files created in the first compiling process?

               

              Regards;

              CMata