3 Replies Latest reply on Jan 16, 2015 12:30 PM by JPMontero_Intel

    Build yocto fail and error (for Galileo)

    KCzarnecki

      Hello, I have a problem with Yocto build. Have anyone met a similar problem and can help?

       

      Build Configuration:

      BB_VERSION        = "1.18.0"

      BUILD_SYS         = "x86_64-linux"

      NATIVELSBSTRING   = "Debian-7.7"

      TARGET_SYS        = "i586-poky-linux-uclibc"

      MACHINE           = "clanton"

      DISTRO            = "clanton-tiny"

      DISTRO_VERSION    = "1.4.2"

      TUNE_FEATURES     = "m32 i586"

      TARGET_FPU        = ""

      meta            

      meta-yocto      

      meta-yocto-bsp    = "clanton:06f237c19ef77215c371b20173f53f00c75e5e8b"

      meta-intel        = "clanton:048def7bae8e3e1a11c91f5071f99bdcf8e6dd16"

      meta-oe           = "clanton:13ae5105ee30410136beeae66ec41ee4a8a2e2b0"

      meta-clanton-distro

      meta-clanton-bsp  = "<unknown>:<unknown>"

       

      NOTE: Resolving any missing task queue dependencies

      NOTE: Preparing runqueue

      NOTE: Executing SetScene Tasks

      NOTE: Executing RunQueue Tasks

      ERROR: Function failed: do_compile (see /home/kafar/Pobrane/Galileo-Runtime-1.0.4/meta-clanton_v1.0.1/yocto_build/tmp/work/clanton-poky-linux-uclibc/linux-yocto-clanton/3.8-r0/temp/log.do_compile.23914 for further information)

      ERROR: Logfile of failure stored in: /home/kafar/Pobrane/Galileo-Runtime-1.0.4/meta-clanton_v1.0.1/yocto_build/tmp/work/clanton-poky-linux-uclibc/linux-yocto-clanton/3.8-r0/temp/log.do_compile.23914

      Log data follows:

      | DEBUG: Executing shell function do_compile

      | NOTE: make -j 14 bzImage CC=i586-poky-linux-uclibc-gcc  LD=i586-poky-linux-uclibc-ld

      | make[3]: Nothing to be done for `all'.

      |   GEN     /home/kafar/Pobrane/Galileo-Runtime-1.0.4/meta-clanton_v1.0.1/yocto_build/tmp/work/clanton-poky-linux-uclibc/linux-yocto-clanton/3.8-r0/linux-clanton-standard-build/Makefile

      |   CHK     include/generated/uapi/linux/version.h

      |   CHK     include/generated/utsrelease.h

      | make[3]: Nothing to be done for `relocs'.

      |   Using /home/kafar/Pobrane/Galileo-Runtime-1.0.4/meta-clanton_v1.0.1/yocto_build/tmp/work/clanton-poky-linux-uclibc/linux-yocto-clanton/3.8-r0/linux as source for kernel

      |   CALL    /home/kafar/Pobrane/Galileo-Runtime-1.0.4/meta-clanton_v1.0.1/yocto_build/tmp/work/clanton-poky-linux-uclibc/linux-yocto-clanton/3.8-r0/linux/scripts/checksyscalls.sh

      |   CHK     include/generated/compile.h

      |   VDSOSYM arch/x86/vdso/vdso32-int80-syms.lds

      |   PASYMS  arch/x86/realmode/rm/pasyms.h

      |   VDSOSYM arch/x86/vdso/vdso32-sysenter-syms.lds

      |   LDS     arch/x86/realmode/rm/realmode.lds

      |   VDSOSYM arch/x86/vdso/vdso32-syms.lds

      |   LD      arch/x86/vdso/built-in.o

      |   LD      arch/x86/realmode/rm/realmode.elf

      |   RELOCS  arch/x86/realmode/rm/realmode.relocs

      |   OBJCOPY arch/x86/realmode/rm/realmode.bin

      |   AS      arch/x86/realmode/rmpiggy.o

      |   LD      arch/x86/realmode/built-in.o

      |   LD      arch/x86/built-in.o

      |   CHK     kernel/config_data.h

      |   CHK     include/generated/uapi/linux/version.h

      | make[4]: Nothing to be done for `all'.

      | make[4]: Nothing to be done for `relocs'.

      | make[5]: execvp: /bin/sh: Argument list too long

      | make[5]: *** [/home/kafar/Pobrane/Galileo-Runtime-1.0.4/meta-clanton_v1.0.1/yocto_build/tmp/work/clanton-poky-linux-uclibc/linux-yocto-clanton/3.8-r0/linux-clanton-standard-build/usr/include/linux/.install] Error 127

      | make[4]: *** [linux] Error 2

      | make[3]: *** [headers_install] Error 2

      | make[2]: *** [vmlinux] Error 2

      | make[1]: *** [sub-make] Error 2

      | make: *** [all] Error 2

      | ERROR: oe_runmake failed

      | ERROR: Function failed: do_compile (see /home/kafar/Pobrane/Galileo-Runtime-1.0.4/meta-clanton_v1.0.1/yocto_build/tmp/work/clanton-poky-linux-uclibc/linux-yocto-clanton/3.8-r0/temp/log.do_compile.23914 for further information)

      ERROR: Task 246 (/home/kafar/Pobrane/Galileo-Runtime-1.0.4/meta-clanton_v1.0.1/meta-clanton-bsp/recipes-kernel/linux/linux-yocto-clanton_3.8.bb, do_compile) failed with exit code '1'

      NOTE: Tasks Summary: Attempted 1382 tasks of which 1380 didn't need to be rerun and 1 failed.

      Waiting for 0 running tasks to finish:

       

      Summary: 1 task failed:

        /home/kafar/Pobrane/Galileo-Runtime-1.0.4/meta-clanton_v1.0.1/meta-clanton-bsp/recipes-kernel/linux/linux-yocto-clanton_3.8.bb, do_compile

      Summary: There was 1 WARNING message shown.

      Summary: There was 1 ERROR message shown, returning a non-zero exit code.

       

       

      Thank You,