3 Replies Latest reply on Nov 26, 2014 4:14 AM by atvreddy

    meta-clanton_v1.0.1/poky/meta/recipes-devtools/autogen/autogen-native_5.12.bb, do_compile, failed

    atvreddy

      | CXXFLAGS_FOR_BUILD=-isystem/home/user/intel_galileo/build_for_sdcard/meta-clanton_v1.0.1/yocto_build/tmp/sysroots/i686-linux/usr/include -O2 -pipe -fpermissive

      | CC=gcc -std=gnu99

      | AGexe=/home/user/intel_galileo/build_for_sdcard/meta-clanton_v1.0.1/yocto_build/tmp/work/i686-linux/autogen-native/5.12-r3/build/agen5/autogen

      | OBJDUMP=objdump

      | base_bindir=/home/user/intel_galileo/build_for_sdcard/meta-clanton_v1.0.1/yocto_build/tmp/sysroots/i686-linux/bin

      | CPP_FOR_BUILD=cpp

      | _=/usr/bin/env

      | AutoGen aborting on signal 11 (Segmentation fault) in state OPTIONS

      | ./mk-agen-texi.sh: line 243:  6566 Aborted                 (core dumped) ${cmd}

      | leaving /home/user/intel_galileo/build_for_sdcard/meta-clanton_v1.0.1/yocto_build/tmp/work/i686-linux/autogen-native/5.12-r3/build/doc/ag-texi-6331.d in place

      | make[2]: *** [agdoc.texi] Terminated

      | make[2]: Leaving directory `/home/user/intel_galileo/build_for_sdcard/meta-clanton_v1.0.1/yocto_build/tmp/work/i686-linux/autogen-native/5.12-r3/build/doc'

      | make[1]: *** [all-recursive] Error 1

      | make[1]: Leaving directory `/home/user/intel_galileo/build_for_sdcard/meta-clanton_v1.0.1/yocto_build/tmp/work/i686-linux/autogen-native/5.12-r3/build'

      | make: *** [all] Error 2

      | ERROR: oe_runmake failed

      | ERROR: Function failed: do_compile (see /home/user/intel_galileo/build_for_sdcard/meta-clanton_v1.0.1/yocto_build/tmp/work/i686-linux/autogen-native/5.12-r3/temp/log.do_compile.4678 for further information)

      ERROR: Task 1177 (/home/user/intel_galileo/build_for_sdcard/meta-clanton_v1.0.1/poky/meta/recipes-devtools/autogen/autogen-native_5.12.bb, do_compile) failed with exit code '1'

      NOTE: Tasks Summary: Attempted 2474 tasks of which 2470 didn't need to be rerun and 1 failed.

      No currently running tasks (2473 of 2494)

       

      Summary: 1 task failed:

        /home/user/intel_galileo/build_for_sdcard/meta-clanton_v1.0.1/poky/meta/recipes-devtools/autogen/autogen-native_5.12.bb, do_compile

      Summary: There was 1 ERROR message shown, returning a non-zero exit code.