4 Replies Latest reply on Jul 27, 2018 6:08 AM by Intel Corporation

    libopenblas-dev package missing. Please install.

    jayeshtank

      Getting a compilation error while make:

       

      CMakeFiles/Crack.dir/src/crack.cpp.o

      In file included from /glob/intel-python/versions/2018u2/intelpython3/include/caffe/util/math_functions.hpp:48:0,

                      from /glob/intel-python/versions/2018u2/intelpython3/include/caffe/filler.hpp:52,

                      from /glob/intel-python/versions/2018u2/intelpython3/include/caffe/caffe.hpp:46,

                      from /home/u14924/workspace/Crack/src/predict.hpp:1,

                      from /home/u14924/workspace/Crack/src/crack.hpp:7,

                      from /home/u14924/workspace/Crack/src/crack.cpp:1:

      /glob/intel-python/versions/2018u2/intelpython3/include/caffe/util/mkl_alternate.hpp:48:19: fatal error: cblas.h: No such file or directory

      #include <cblas.h>

                        ^

      compilation terminated.

      make[3]: *** [CMakeFiles/Crack.dir/src/crack.cpp.o] Error 1

      make[2]: *** [CMakeFiles/Crack.dir/all] Error 2

      make[1]: *** [CMakeFiles/Crack.dir/rule] Error 2

      make: *** [Crack] Error 2

      Solution is to install libopenblas-dev package. Could you please install on DevCloud and inform. Thanks.