8 Replies Latest reply on Apr 4, 2016 8:46 AM by Amy_Intel

    Please check your Processor Thermal Solution

    PhilO

      I just updated IntelProcessor Diagnostic Tool 64bit to the latest version and one test is failing.

      1 degrees C below maximum

      Test Result - FAIL

      Expected Greater than 1 degrees below max

      Received 1 degrees below max

      Test FAILED

      Please check your Processor Thermal Solution

      Temperature Monitor Stopped

      I've never seen this error before.

       

      Of course, I did not run the test with the older version of the tool prior to upgrading.  My question is, has the test changed so that it's more sensitive or do I really have an issue and if so, specifically, what do I do about it?

      My "rig" is about 6 years old.

       

      Thanks,

      Phil

        • 1. Re: Please check your Processor Thermal Solution
          Amy_Intel

          Hello, PhilO:

           

          Please provide us with the following information;

           

           

          Regards,

          • 2. Re: Please check your Processor Thermal Solution
            Kai372

            I also installed the Intel Processor Diagnostic Tool (Revision 3.0.0.25.W.MP) and unexpectedly received a failed temperature test immediately after the test began. There are no stability problems at all when the CPU runs different applications at 100% load. The processor I am using is a Pentium 4 662 which has Thermal Monitoring Technologies according to the following link to specifications:

             

            Intel® Pentium® 4 Processor 662 supporting HT Technology (2M Cache, 3.60 GHz, 800 MHz FSB) Specifications

             

            The motherboard model is Gigabyte GA-8ANXP-D. The BIOS settings indicate that Thermal Monitoring 2 is enabled.

             

            Not all of the Pentium 4 processors have Thermal Monitoring Technologies. Perhaps the diagnostic tool is not running the temperature test correctly because of confusion about which models have Thermal Monitoring. Please help solve this problem I am having with the Intel Processor Diagnostic Tool:

             

            Here is the file TESTRESULTS.TXT from the Intel Processor Diagnostic Tool:

             

            --- IPDT64 - Revision: 3.0.0.25.W.MP

            --- IPDT64 - Start Time: 3/24/2016 12:34:44 AM

             

            --------------------------------------------------------------------

            Processor 1

            --------------------------------------------------------------------

            Intel(R) spbc Module Test

            Module Version: 1.0.7.64b.W

            Start Time: Thu Mar 24 00:34:47 2016

            Test Result - PASS

            ..!!..Processor under test is verified as 'PRODUCTION'..!!..

             

            Processor Manufacturer: GenuineIntel

            Processor Brand String:               Intel(R) Pentium(R) 4 CPU 3.60GHz

             

            End Time: Thu Mar 24 00:34:47 2016

            Total Time:  seconds: 0

            --------------------------------------------------------------------

            Genuine Intel CPU Test

            Module Version: 1.0.12.64b.W

            Start Time: Thu Mar 24 00:34:48 2016

            Test Result - PASS

            Expected: GenuineIntel

            Detected: GenuineIntel

            End Time: Thu Mar 24 00:34:48 2016

            Total Time:  seconds: 0

            --------------------------------------------------------------------

            Temperature Test

            Module Version: 1.0.12.64b.W

            Start Time: Thu Mar 24 00:34:49 2016

            Test Result - FAIL

            Expected: Greater than 1 degrees below max

            Received: 0 degrees below max

            End Time: Thu Mar 24 00:34:49 2016

            Total Time:  seconds: 0

            --------------------------------------------------------------------

            --- IPDT64 - Temperature Monitor Results

            Temperature Monitor will begin when CPULoad Test starts

            Temperature Monitor Stopped

             

            --------------------------------------------------------------------

             

            System Information

            ------------------

            Processor Name: Intel(R) Pentium(R) 4 CPU 3.60GHz

            Processor Information: Intel64 Family 15 Model 4 Stepping 10

            Number of Physical Cores: 1

            Number of Logical Cores: 2

            Installed System Memory: 3 GB

            Operating System: Microsoft Windows 7 Professional 64-bit

            Graphics Information: NVIDIA GeForce 8600 GT

            System Product: 8ANXP-D

            System BIOS: F2

            --------------------------------------------------------------------

             

            --- IPDT64 - End Time: 3/24/2016 12:34:49 AM

            --- IPDT64 - Result: Fail

            --------------------------------------------------------------------

            • 3. Re: Please check your Processor Thermal Solution
              PhilO

              Hi Amy,

               

              1. Home built system.
              2. i7-950 3.06 Quad Core CPU and an GIGABYTE GA-EX58-UD5 motherboard
              3. Windows 7
              4. Yes, version 3.0.0.25 64 bit
              5. Typically, it does not crash.
              6. Results file:

              --- IPDT64 - Revision: 3.0.0.25.W.MP

              --- IPDT64 - Start Time: 3/25/2016 7:25:26 AM

               

              --------------------------------------------------------------------

              Processor 1

              --------------------------------------------------------------------

              Genuine Intel CPU Test

              Module Version: 1.0.12.64b.W

              Start Time: Fri Mar 25 07:25:26 2016

              Test Result - PASS

              Expected: GenuineIntel

              Detected: GenuineIntel

              End Time: Fri Mar 25 07:25:26 2016

              Total Time:  seconds: 0

              --------------------------------------------------------------------

              Temperature Test

              Module Version: 1.0.12.64b.W

              Start Time: Fri Mar 25 07:25:26 2016

              Test Result - PASS

              Expected: Greater than 1 degrees below max

              Received: 2 degrees below max

              End Time: Fri Mar 25 07:25:26 2016

              Total Time:  seconds: 0

              --------------------------------------------------------------------

              CPU Brand String Test

              Module Version: 1.0.12.64b.W

              Start Time: Fri Mar 25 07:25:26 2016

              Test Result - PASS

              Expected String Parts: As Defined in BrandString_LocalConfig.xml

              Detected: Intel(R) Core(TM) i7 CPU         950  @ 3.07GHz

              End Time: Fri Mar 25 07:25:26 2016

              Total Time:  seconds: 0

              --------------------------------------------------------------------

              CPU Frequency Test

              Module Version: 1.0.14.64b.W

              Start Time: Fri Mar 25 07:25:26 2016

              Test Result - PASS

              Processor Name: Intel(R) Core(TM) i7 CPU         950  @ 3.07GHz

              Expected CPU Frequency: 3.07

              Detected CPU Frequency: 3.49783

              Expected Base Clock: 133.33

              Detected Base Clock: 134.532

              Expected frequency - The highest frequency at which the tested processor was manufactured to operate

              Detected frequency - The frequency at which the tested processor is currently operating

              Power management modes can create marginally higher or lower detected frequency

              than expected frequency. Small variations in clock frequencies are common.

              QPI link rate Test - Not supported.

              Skipping QPI link rate Test.

              End Time: Fri Mar 25 07:25:31 2016

              Total Time:  seconds: 5

              --------------------------------------------------------------------

              Floating Point Test

              Module Version: 1.0.10.64b.W

              Start Time: Fri Mar 25 07:25:31 2016

              Test Result - PASS

              Million Floating Points per Second, MFLOPS: 331.2

              Error: 0

              --- Floating Point Test Passed!!!---

              End Time: Fri Mar 25 07:25:33 2016

              Total Time:  seconds: 2

              --------------------------------------------------------------------

              Prime Number Generation Test

              Module Version: 1.0.10.64b.W

              Start Time: Fri Mar 25 07:25:33 2016

              Test Result - PASS

              Operation Per Second: 3.98747e+006

              Error: 0

              --- Prime Number Generation Test Passed!!!---

              End Time: Fri Mar 25 07:25:35 2016

              Total Time:  seconds: 2

              --------------------------------------------------------------------

              Cache Test

              Module Version: 1.0.10.64b.W

              Start Time: Fri Mar 25 07:25:35 2016

              Test Result - PASS

               

              --- Reading Cache Size --- 

               

              - Detected L1 Data Cache Size --> 32

              - Detected L1 Inst Cache Size --> 32

               

              - Detected L2 Cache Size --> 256

              - Detected L3 Cache Size --> 8192

               

              Cache Size Test Passed!!!

               

              End Time: Fri Mar 25 07:25:35 2016

              Total Time:  seconds: 0

              --------------------------------------------------------------------

              MMXSSE Test

              Module Version: 1.0.10.64b.W

              Start Time: Fri Mar 25 07:25:35 2016

              Test Result - PASS

               

              --- Determining MMX - SSE capabilities ---

                       --- CPU FEATURES DETECTION FOR ---

                              ---        MMX SSE       ---

              MMX         - MMX Supported -->    Yes

              SSE         - SSE Supported -->    Yes

              SSE2         - SSE2 Supported -->    Yes

              SSE3         - SSE3 Supported -->    Yes

              SSSE3         - SSSE3 Supported -->    Yes

              SSE4.1         - SSE4.1 Supported -->    Yes

              SSE4.2         - SSE4.2 Supported -->    Yes

                      --- MMX SSE - capabilities check complete ---

              MMX Test Result --- PASS

              SSE Test Result --- PASS

              SSE2 Test Result --- PASS

              SSE3 Test Result --- PASS

              SSSE3 Test Result --- PASS

              SSE4.1 Test Result --- PASS

              SSE4.2 Test Result --- PASS

               

              End Time: Fri Mar 25 07:25:35 2016

              Total Time:  seconds: 0

              --------------------------------------------------------------------

              AVX Test

              Module Version: 1.0.11.64b.W

              Start Time: Fri Mar 25 07:25:35 2016

              Test Result - PASS

               

              --- Determining AVX AES PCLMULQDQ capabilities ---

                       --- CPU FEATURES DETECTION FOR ---

                             --- AVX/AES/PCLMULQDQ ---

              AVX         - Advanced Vector Extensions Supported -->    No

              AVX OS Support   - AVX Operating System Supported -->        No ---> No Test Required

              AES         - Advanced Encryption Standard Supported -->    No ---> No Test Required

              PCLMULQDQ     - Polys Carry-Less Multiply Supported -->    No ---> No Test Required

                  --- AVX AES PCLMULQDQ capabilities check complete ---

              AVX Compare Test Result --- Not Tested

              AES Test Result --- Not Tested

              PCLMULQDQ Test Result --- Not Tested

              No AVX AES PCLMULQDQ Tests required

               

              End Time: Fri Mar 25 07:25:35 2016

              Total Time:  seconds: 0

              --------------------------------------------------------------------

              IMC Test

              Module Version: 1.0.7.64b.W

              Start Time: Fri Mar 25 07:25:35 2016

              Test Result - PASS

              --- Reading Memory Size ---

              Detected Memory Size is --> 12.00GB

              --- Subtest - Memory Size Test Passed!!!  ---

              --- Integrated Memory Controller Stress Test ---

              Memory to be allocated = 1048576 byte

              Memory Allocated.

              Test 1 Ones and Zeros Moving Inversions write operations - Passed

              Test 1 Ones and Zeros Moving Inversions verification operations - Passed

              Test 2 32Bits Sliding Ones write operations - Passed

              Test 2 32Bits Sliding Ones verification operations - Passed

              Test 3 32Bits Sliding Zero write operations - Passed

              Test 3 32Bits Sliding Zero verification operations - Passed

              Memory Deallocated.

              --- Subtest - Memory Stress Test Passed!!!  ---

              Integrated Memory Controller Stress Test Passed!!!

              End Time: Fri Mar 25 07:25:35 2016

              Total Time:  seconds: 0

              --------------------------------------------------------------------

              PCH Test

              Module Version: 1.0.9.64b.W

              Start Time: Fri Mar 25 07:25:35 2016

              Test Result - Config Mismatch

              Platform Controller Hub Test not supported current chipset.

              Skipping Platform Controller Hub Test.

              End Time: Fri Mar 25 07:25:35 2016

              Total Time:  seconds: 0

              --------------------------------------------------------------------

              IGD Module Test

              Module Version: 1.0.12.64b.W

              Start Time: Fri Mar 25 07:25:36 2016

              Test Result: Intel(R) Integrated Graphics Device Not Detected or Not Configured, Test Skipped

              End Time: Fri Mar 25 07:25:36 2016

              Total Time:  seconds: 0

              --------------------------------------------------------------------

              GFX Module Test

              Module Version: 1.0.12.64b.W

              Start Time: Fri Mar 25 07:25:36 2016

              GFX Module Test: PASS

              End Time: Fri Mar 25 07:26:04 2016

              Total Time:  seconds: 28

              --------------------------------------------------------------------

              --- IPDT64 - Temperature Monitor Results

               

              --- Temperature Test ---

              ...

              Version 1.0.12.64b.W

              ...

               

              4 degrees C below maximum

              Test Result - PASS

              Expected Greater than 1 degrees below max

              Received 4 degrees below max

               

              --- Temperature Test ---

              ...

              Version 1.0.12.64b.W

              ...

               

               

              Entering run forever

              3 degrees C below maximum

              Test Result - PASS

              Expected Greater than 1 degrees below max

              Received 3 degrees below max

              Test PASSED

              3 degrees C below maximum

              Test Result - PASS

              Expected Greater than 1 degrees below max

              Received 3 degrees below max

              Test PASSED

              3 degrees C below maximum

              Test Result - PASS

              Expected Greater than 1 degrees below max

              Received 3 degrees below max

              Test PASSED

              3 degrees C below maximum

              Test Result - PASS

              Expected Greater than 1 degrees below max

              Received 3 degrees below max

              Test PASSED

              3 degrees C below maximum

              Test Result - PASS

              Expected Greater than 1 degrees below max

              Received 3 degrees below max

              Test PASSED

              3 degrees C below maximum

              Test Result - PASS

              Expected Greater than 1 degrees below max

              Received 3 degrees below max

              Test PASSED

              3 degrees C below maximum

              Test Result - PASS

              Expected Greater than 1 degrees below max

              Received 3 degrees below max

              Test PASSED

              3 degrees C below maximum

              Test Result - PASS

              Expected Greater than 1 degrees below max

              Received 3 degrees below max

              Test PASSED

              3 degrees C below maximum

              Test Result - PASS

              Expected Greater than 1 degrees below max

              Received 3 degrees below max

              Test PASSED

              4 degrees C below maximum

              Test Result - PASS

              Expected Greater than 1 degrees below max

              Received 4 degrees below max

              Test PASSED

              2 degrees C below maximum

              Test Result - PASS

              Expected Greater than 1 degrees below max

              Received 2 degrees below max

              Test PASSED

              3 degrees C below maximum

              Test Result - PASS

              Expected Greater than 1 degrees below max

              Received 3 degrees below max

              Test PASSED

              3 degrees C below maximum

              Test Result - PASS

              Expected Greater than 1 degrees below max

              Received 3 degrees below max

              Test PASSED

              3 degrees C below maximum

              Test Result - PASS

              Expected Greater than 1 degrees below max

              Received 3 degrees below max

              Test PASSED

              3 degrees C below maximum

              Test Result - PASS

              Expected Greater than 1 degrees below max

              Received 3 degrees below max

              Test PASSED

              3 degrees C below maximum

              Test Result - PASS

              Expected Greater than 1 degrees below max

              Received 3 degrees below max

              Test PASSED

              3 degrees C below maximum

              Test Result - PASS

              Expected Greater than 1 degrees below max

              Received 3 degrees below max

              Test PASSED

              3 degrees C below maximum

              Test Result - PASS

              Expected Greater than 1 degrees below max

              Received 3 degrees below max

              Test PASSED

              3 degrees C below maximum

              Test Result - PASS

              Expected Greater than 1 degrees below max

              Received 3 degrees below max

              Test PASSED

              3 degrees C below maximum

              Test Result - PASS

              Expected Greater than 1 degrees below max

              Received 3 degrees below max

              Test PASSED

              3 degrees C below maximum

              Test Result - PASS

              Expected Greater than 1 degrees below max

              Received 3 degrees below max

              Test PASSED

              3 degrees C below maximum

              Test Result - PASS

              Expected Greater than 1 degrees below max

              Received 3 degrees below max

              Test PASSED

              3 degrees C below maximum

              Test Result - PASS

              Expected Greater than 1 degrees below max

              Received 3 degrees below max

              Test PASSED

              3 degrees C below maximum

              Test Result - PASS

              Expected Greater than 1 degrees below max

              Received 3 degrees below max

              Test PASSED

              3 degrees C below maximum

              Test Result - PASS

              Expected Greater than 1 degrees below max

              Received 3 degrees below max

              Test PASSED

              3 degrees C below maximum

              Test Result - PASS

              Expected Greater than 1 degrees below max

              Received 3 degrees below max

              Test PASSED

              3 degrees C below maximum

              Test Result - PASS

              Expected Greater than 1 degrees below max

              Received 3 degrees below max

              Test PASSED

              3 degrees C below maximum

              Test Result - PASS

              Expected Greater than 1 degrees below max

              Received 3 degrees below max

              Test PASSED

              3 degrees C below maximum

              Test Result - PASS

              Expected Greater than 1 degrees below max

              Received 3 degrees below max

              Test PASSED

              3 degrees C below maximum

              Test Result - PASS

              Expected Greater than 1 degrees below max

              Received 3 degrees below max

              Test PASSED

              3 degrees C below maximum

              Test Result - PASS

              Expected Greater than 1 degrees below max

              Received 3 degrees below max

              Test PASSED

              2 degrees C below maximum

              Test Result - PASS

              Expected Greater than 1 degrees below max

              Received 2 degrees below max

              Test PASSED

              3 degrees C below maximum

              Test Result - PASS

              Expected Greater than 1 degrees below max

              Received 3 degrees below max

              Test PASSED

              3 degrees C below maximum

              Test Result - PASS

              Expected Greater than 1 degrees below max

              Received 3 degrees below max

              Test PASSED

              3 degrees C below maximum

              Test Result - PASS

              Expected Greater than 1 degrees below max

              Received 3 degrees below max

              Test PASSED

              3 degrees C below maximum

              Test Result - PASS

              Expected Greater than 1 degrees below max

              Received 3 degrees below max

              Test PASSED

              1 degrees C below maximum

              Test Result - FAIL

              Expected Greater than 1 degrees below max

              Received 1 degrees below max

              Test FAILED

              Please check your Processor Thermal Solution

              Temperature Monitor Stopped

               

              --------------------------------------------------------------------

               

              System Information

              ------------------

              Processor Name: Intel(R) Core(TM) i7 CPU         950  @ 3.07GHz

              Processor Information: Intel64 Family 6 Model 26 Stepping 5

              Number of Physical Cores: 4

              Number of Logical Cores: 8

              Installed System Memory: 12 GB

              Operating System: Microsoft Windows 7 Ultimate 64-bit

              Graphics Information: NVIDIA GeForce GTX 275

              System Product: EX58-UD5

              System BIOS: F13

              --------------------------------------------------------------------

               

              --- IPDT64 - End Time: 3/25/2016 7:29:13 AM

              --- IPDT64 - Result: Fail

              --------------------------------------------------------------------

              --- IPDT64 - Temperature Monitor Results

               

              --- Temperature Test ---

              ...

              Version 1.0.12.64b.W

              ...

               

              4 degrees C below maximum

              Test Result - PASS

              Expected Greater than 1 degrees below max

              Received 4 degrees below max

               

              --- Temperature Test ---

              ...

              Version 1.0.12.64b.W

              ...

               

               

              Entering run forever

              3 degrees C below maximum

              Test Result - PASS

              Expected Greater than 1 degrees below max

              Received 3 degrees below max

              Test PASSED

              3 degrees C below maximum

              Test Result - PASS

              Expected Greater than 1 degrees below max

              Received 3 degrees below max

              Test PASSED

              3 degrees C below maximum

              Test Result - PASS

              Expected Greater than 1 degrees below max

              Received 3 degrees below max

              Test PASSED

              3 degrees C below maximum

              Test Result - PASS

              Expected Greater than 1 degrees below max

              Received 3 degrees below max

              Test PASSED

              3 degrees C below maximum

              Test Result - PASS

              Expected Greater than 1 degrees below max

              Received 3 degrees below max

              Test PASSED

              3 degrees C below maximum

              Test Result - PASS

              Expected Greater than 1 degrees below max

              Received 3 degrees below max

              Test PASSED

              3 degrees C below maximum

              Test Result - PASS

              Expected Greater than 1 degrees below max

              Received 3 degrees below max

              Test PASSED

              3 degrees C below maximum

              Test Result - PASS

              Expected Greater than 1 degrees below max

              Received 3 degrees below max

              Test PASSED

              3 degrees C below maximum

              Test Result - PASS

              Expected Greater than 1 degrees below max

              Received 3 degrees below max

              Test PASSED

              4 degrees C below maximum

              Test Result - PASS

              Expected Greater than 1 degrees below max

              Received 4 degrees below max

              Test PASSED

              2 degrees C below maximum

              Test Result - PASS

              Expected Greater than 1 degrees below max

              Received 2 degrees below max

              Test PASSED

              3 degrees C below maximum

              Test Result - PASS

              Expected Greater than 1 degrees below max

              Received 3 degrees below max

              Test PASSED

              3 degrees C below maximum

              Test Result - PASS

              Expected Greater than 1 degrees below max

              Received 3 degrees below max

              Test PASSED

              3 degrees C below maximum

              Test Result - PASS

              Expected Greater than 1 degrees below max

              Received 3 degrees below max

              Test PASSED

              3 degrees C below maximum

              Test Result - PASS

              Expected Greater than 1 degrees below max

              Received 3 degrees below max

              Test PASSED

              3 degrees C below maximum

              Test Result - PASS

              Expected Greater than 1 degrees below max

              Received 3 degrees below max

              Test PASSED

              3 degrees C below maximum

              Test Result - PASS

              Expected Greater than 1 degrees below max

              Received 3 degrees below max

              Test PASSED

              3 degrees C below maximum

              Test Result - PASS

              Expected Greater than 1 degrees below max

              Received 3 degrees below max

              Test PASSED

              3 degrees C below maximum

              Test Result - PASS

              Expected Greater than 1 degrees below max

              Received 3 degrees below max

              Test PASSED

              3 degrees C below maximum

              Test Result - PASS

              Expected Greater than 1 degrees below max

              Received 3 degrees below max

              Test PASSED

              3 degrees C below maximum

              Test Result - PASS

              Expected Greater than 1 degrees below max

              Received 3 degrees below max

              Test PASSED

              3 degrees C below maximum

              Test Result - PASS

              Expected Greater than 1 degrees below max

              Received 3 degrees below max

              Test PASSED

              3 degrees C below maximum

              Test Result - PASS

              Expected Greater than 1 degrees below max

              Received 3 degrees below max

              Test PASSED

              3 degrees C below maximum

              Test Result - PASS

              Expected Greater than 1 degrees below max

              Received 3 degrees below max

              Test PASSED

              3 degrees C below maximum

              Test Result - PASS

              Expected Greater than 1 degrees below max

              Received 3 degrees below max

              Test PASSED

              3 degrees C below maximum

              Test Result - PASS

              Expected Greater than 1 degrees below max

              Received 3 degrees below max

              Test PASSED

              3 degrees C below maximum

              Test Result - PASS

              Expected Greater than 1 degrees below max

              Received 3 degrees below max

              Test PASSED

              3 degrees C below maximum

              Test Result - PASS

              Expected Greater than 1 degrees below max

              Received 3 degrees below max

              Test PASSED

              3 degrees C below maximum

              Test Result - PASS

              Expected Greater than 1 degrees below max

              Received 3 degrees below max

              Test PASSED

              3 degrees C below maximum

              Test Result - PASS

              Expected Greater than 1 degrees below max

              Received 3 degrees below max

              Test PASSED

              3 degrees C below maximum

              Test Result - PASS

              Expected Greater than 1 degrees below max

              Received 3 degrees below max

              Test PASSED

              2 degrees C below maximum

              Test Result - PASS

              Expected Greater than 1 degrees below max

              Received 2 degrees below max

              Test PASSED

              3 degrees C below maximum

              Test Result - PASS

              Expected Greater than 1 degrees below max

              Received 3 degrees below max

              Test PASSED

              3 degrees C below maximum

              Test Result - PASS

              Expected Greater than 1 degrees below max

              Received 3 degrees below max

              Test PASSED

              3 degrees C below maximum

              Test Result - PASS

              Expected Greater than 1 degrees below max

              Received 3 degrees below max

              Test PASSED

              3 degrees C below maximum

              Test Result - PASS

              Expected Greater than 1 degrees below max

              Received 3 degrees below max

              Test PASSED

              1 degrees C below maximum

              Test Result - FAIL

              Expected Greater than 1 degrees below max

              Received 1 degrees below max

              Test FAILED

              Please check your Processor Thermal Solution

              Temperature Monitor Stopped

               

              --------------------------------------------------------------------

               

              System Information

              ------------------

              Processor Name: Intel(R) Core(TM) i7 CPU         950  @ 3.07GHz

              Processor Information: Intel64 Family 6 Model 26 Stepping 5

              Number of Physical Cores: 4

              Number of Logical Cores: 8

              Installed System Memory: 12 GB

              Operating System: Microsoft Windows 7 Ultimate 64-bit

              Graphics Information: NVIDIA GeForce GTX 275

              System Product: EX58-UD5

              System BIOS: F13

              --------------------------------------------------------------------

               

              --- IPDT64 - End Time: 3/25/2016 7:29:13 AM

              --- IPDT64 - Result: Fail

              --------------------------------------------------------------------

              Module - CPULoad.exe did not create a results file.

              CPULoad.exe Exit Code = -1

              --------------------------------------------------------------------

              --- IPDT64 - Temperature Monitor Results

               

              --- Temperature Test ---

              ...

              Version 1.0.12.64b.W

              ...

               

              4 degrees C below maximum

              Test Result - PASS

              Expected Greater than 1 degrees below max

              Received 4 degrees below max

               

              --- Temperature Test ---

              ...

              Version 1.0.12.64b.W

              ...

               

               

              Entering run forever

              3 degrees C below maximum

              Test Result - PASS

              Expected Greater than 1 degrees below max

              Received 3 degrees below max

              Test PASSED

              3 degrees C below maximum

              Test Result - PASS

              Expected Greater than 1 degrees below max

              Received 3 degrees below max

              Test PASSED

              3 degrees C below maximum

              Test Result - PASS

              Expected Greater than 1 degrees below max

              Received 3 degrees below max

              Test PASSED

              3 degrees C below maximum

              Test Result - PASS

              Expected Greater than 1 degrees below max

              Received 3 degrees below max

              Test PASSED

              3 degrees C below maximum

              Test Result - PASS

              Expected Greater than 1 degrees below max

              Received 3 degrees below max

              Test PASSED

              3 degrees C below maximum

              Test Result - PASS

              Expected Greater than 1 degrees below max

              Received 3 degrees below max

              Test PASSED

              3 degrees C below maximum

              Test Result - PASS

              Expected Greater than 1 degrees below max

              Received 3 degrees below max

              Test PASSED

              3 degrees C below maximum

              Test Result - PASS

              Expected Greater than 1 degrees below max

              Received 3 degrees below max

              Test PASSED

              3 degrees C below maximum

              Test Result - PASS

              Expected Greater than 1 degrees below max

              Received 3 degrees below max

              Test PASSED

              4 degrees C below maximum

              Test Result - PASS

              Expected Greater than 1 degrees below max

              Received 4 degrees below max

              Test PASSED

              2 degrees C below maximum

              Test Result - PASS

              Expected Greater than 1 degrees below max

              Received 2 degrees below max

              Test PASSED

              3 degrees C below maximum

              Test Result - PASS

              Expected Greater than 1 degrees below max

              Received 3 degrees below max

              Test PASSED

              3 degrees C below maximum

              Test Result - PASS

              Expected Greater than 1 degrees below max

              Received 3 degrees below max

              Test PASSED

              3 degrees C below maximum

              Test Result - PASS

              Expected Greater than 1 degrees below max

              Received 3 degrees below max

              Test PASSED

              3 degrees C below maximum

              Test Result - PASS

              Expected Greater than 1 degrees below max

              Received 3 degrees below max

              Test PASSED

              3 degrees C below maximum

              Test Result - PASS

              Expected Greater than 1 degrees below max

              Received 3 degrees below max

              Test PASSED

              3 degrees C below maximum

              Test Result - PASS

              Expected Greater than 1 degrees below max

              Received 3 degrees below max

              Test PASSED

              3 degrees C below maximum

              Test Result - PASS

              Expected Greater than 1 degrees below max

              Received 3 degrees below max

              Test PASSED

              3 degrees C below maximum

              Test Result - PASS

              Expected Greater than 1 degrees below max

              Received 3 degrees below max

              Test PASSED

              3 degrees C below maximum

              Test Result - PASS

              Expected Greater than 1 degrees below max

              Received 3 degrees below max

              Test PASSED

              3 degrees C below maximum

              Test Result - PASS

              Expected Greater than 1 degrees below max

              Received 3 degrees below max

              Test PASSED

              3 degrees C below maximum

              Test Result - PASS

              Expected Greater than 1 degrees below max

              Received 3 degrees below max

              Test PASSED

              3 degrees C below maximum

              Test Result - PASS

              Expected Greater than 1 degrees below max

              Received 3 degrees below max

              Test PASSED

              3 degrees C below maximum

              Test Result - PASS

              Expected Greater than 1 degrees below max

              Received 3 degrees below max

              Test PASSED

              3 degrees C below maximum

              Test Result - PASS

              Expected Greater than 1 degrees below max

              Received 3 degrees below max

              Test PASSED

              3 degrees C below maximum

              Test Result - PASS

              Expected Greater than 1 degrees below max

              Received 3 degrees below max

              Test PASSED

              3 degrees C below maximum

              Test Result - PASS

              Expected Greater than 1 degrees below max

              Received 3 degrees below max

              Test PASSED

              3 degrees C below maximum

              Test Result - PASS

              Expected Greater than 1 degrees below max

              Received 3 degrees below max

              Test PASSED

              3 degrees C below maximum

              Test Result - PASS

              Expected Greater than 1 degrees below max

              Received 3 degrees below max

              Test PASSED

              3 degrees C below maximum

              Test Result - PASS

              Expected Greater than 1 degrees below max

              Received 3 degrees below max

              Test PASSED

              3 degrees C below maximum

              Test Result - PASS

              Expected Greater than 1 degrees below max

              Received 3 degrees below max

              Test PASSED

              2 degrees C below maximum

              Test Result - PASS

              Expected Greater than 1 degrees below max

              Received 2 degrees below max

              Test PASSED

              3 degrees C below maximum

              Test Result - PASS

              Expected Greater than 1 degrees below max

              Received 3 degrees below max

              Test PASSED

              3 degrees C below maximum

              Test Result - PASS

              Expected Greater than 1 degrees below max

              Received 3 degrees below max

              Test PASSED

              3 degrees C below maximum

              Test Result - PASS

              Expected Greater than 1 degrees below max

              Received 3 degrees below max

              Test PASSED

              3 degrees C below maximum

              Test Result - PASS

              Expected Greater than 1 degrees below max

              Received 3 degrees below max

              Test PASSED

              1 degrees C below maximum

              Test Result - FAIL

              Expected Greater than 1 degrees below max

              Received 1 degrees below max

              Test FAILED

              Please check your Processor Thermal Solution

              Temperature Monitor Stopped

               

              --------------------------------------------------------------------

               

              System Information

              ------------------

              Processor Name: Intel(R) Core(TM) i7 CPU         950  @ 3.07GHz

              Processor Information: Intel64 Family 6 Model 26 Stepping 5

              Number of Physical Cores: 4

              Number of Logical Cores: 8

              Installed System Memory: 12 GB

              Operating System: Microsoft Windows 7 Ultimate 64-bit

              Graphics Information: NVIDIA GeForce GTX 275

              System Product: EX58-UD5

              System BIOS: F13

              --------------------------------------------------------------------

               

              --- IPDT64 - End Time: 3/25/2016 7:29:13 AM

              --- IPDT64 - Result: Fail

              --------------------------------------------------------------------

               

              Thanks,

              Phil

              • 4. Re: Please check your Processor Thermal Solution
                Amy_Intel

                I have noticed that your processor is overclocked, note the following

                 

                                    >>Expected CPU Frequency: 3.07

                                    >>Detected CPU Frequency: 3.49783

                 

                Please enter the BIOS, set the default values and run the test one more time.

                 

                Regards,

                • 5. Re: Please check your Processor Thermal Solution
                  PhilO

                  Amy,

                  I never overclocked it, used it as it came out of the box.  Also I just ran the test again and it passed this time.  This is odd, isn't it?

                  --- IPDT64 - Revision: 3.0.0.25.W.MP

                  --- IPDT64 - Start Time: 3/25/2016 12:43:12 PM

                   

                  --------------------------------------------------------------------

                  Processor 1

                  --------------------------------------------------------------------

                  Genuine Intel CPU Test

                  Module Version: 1.0.12.64b.W

                  Start Time: Fri Mar 25 12:43:12 2016

                  Test Result - PASS

                  Expected: GenuineIntel

                  Detected: GenuineIntel

                  End Time: Fri Mar 25 12:43:12 2016

                  Total Time:  seconds: 0

                  --------------------------------------------------------------------

                  Temperature Test

                  Module Version: 1.0.12.64b.W

                  Start Time: Fri Mar 25 12:43:12 2016

                  Test Result - PASS

                  Expected: Greater than 1 degrees below max

                  Received: 7 degrees below max

                  End Time: Fri Mar 25 12:43:13 2016

                  Total Time:  seconds: 1

                  --------------------------------------------------------------------

                  CPU Brand String Test

                  Module Version: 1.0.12.64b.W

                  Start Time: Fri Mar 25 12:43:13 2016

                  Test Result - PASS

                  Expected String Parts: As Defined in BrandString_LocalConfig.xml

                  Detected: Intel(R) Core(TM) i7 CPU         950  @ 3.07GHz

                  End Time: Fri Mar 25 12:43:13 2016

                  Total Time:  seconds: 0

                  --------------------------------------------------------------------

                  CPU Frequency Test

                  Module Version: 1.0.14.64b.W

                  Start Time: Fri Mar 25 12:43:13 2016

                  Test Result - PASS

                  Processor Name: Intel(R) Core(TM) i7 CPU         950  @ 3.07GHz

                  Expected CPU Frequency: 3.07

                  Detected CPU Frequency: 5.43968

                  Expected Base Clock: 133.33

                  Detected Base Clock: 135.992

                  Expected frequency - The highest frequency at which the tested processor was manufactured to operate

                  Detected frequency - The frequency at which the tested processor is currently operating

                  Power management modes can create marginally higher or lower detected frequency

                  than expected frequency. Small variations in clock frequencies are common.

                  QPI link rate Test - Not supported.

                  Skipping QPI link rate Test.

                  End Time: Fri Mar 25 12:43:14 2016

                  Total Time:  seconds: 1

                  --------------------------------------------------------------------

                  Floating Point Test

                  Module Version: 1.0.10.64b.W

                  Start Time: Fri Mar 25 12:43:15 2016

                  Test Result - PASS

                  Million Floating Points per Second, MFLOPS: 345.6

                  Error: 0

                  --- Floating Point Test Passed!!!---

                  End Time: Fri Mar 25 12:43:17 2016

                  Total Time:  seconds: 2

                  --------------------------------------------------------------------

                  Prime Number Generation Test

                  Module Version: 1.0.10.64b.W

                  Start Time: Fri Mar 25 12:43:17 2016

                  Test Result - PASS

                  Operation Per Second: 4.65205e+006

                  Error: 0

                  --- Prime Number Generation Test Passed!!!---

                  End Time: Fri Mar 25 12:43:19 2016

                  Total Time:  seconds: 2

                  --------------------------------------------------------------------

                  Cache Test

                  Module Version: 1.0.10.64b.W

                  Start Time: Fri Mar 25 12:43:19 2016

                  Test Result - PASS

                   

                  --- Reading Cache Size ---

                   

                  - Detected L1 Data Cache Size --> 32

                  - Detected L1 Inst Cache Size --> 32

                   

                  - Detected L2 Cache Size --> 256

                  - Detected L3 Cache Size --> 8192

                   

                  Cache Size Test Passed!!!

                   

                  End Time: Fri Mar 25 12:43:19 2016

                  Total Time:  seconds: 0

                  --------------------------------------------------------------------

                  MMXSSE Test

                  Module Version: 1.0.10.64b.W

                  Start Time: Fri Mar 25 12:43:19 2016

                  Test Result - PASS

                   

                  --- Determining MMX - SSE capabilities ---

                           --- CPU FEATURES DETECTION FOR ---

                                  ---        MMX SSE       ---

                  MMX         - MMX Supported -->    Yes

                  SSE         - SSE Supported -->    Yes

                  SSE2         - SSE2 Supported -->    Yes

                  SSE3         - SSE3 Supported -->    Yes

                  SSSE3         - SSSE3 Supported -->    Yes

                  SSE4.1         - SSE4.1 Supported -->    Yes

                  SSE4.2         - SSE4.2 Supported -->    Yes

                          --- MMX SSE - capabilities check complete ---

                  MMX Test Result --- PASS

                  SSE Test Result --- PASS

                  SSE2 Test Result --- PASS

                  SSE3 Test Result --- PASS

                  SSSE3 Test Result --- PASS

                  SSE4.1 Test Result --- PASS

                  SSE4.2 Test Result --- PASS

                   

                  End Time: Fri Mar 25 12:43:19 2016

                  Total Time:  seconds: 0

                  --------------------------------------------------------------------

                  AVX Test

                  Module Version: 1.0.11.64b.W

                  Start Time: Fri Mar 25 12:43:19 2016

                  Test Result - PASS

                   

                  --- Determining AVX AES PCLMULQDQ capabilities ---

                           --- CPU FEATURES DETECTION FOR ---

                                 --- AVX/AES/PCLMULQDQ ---

                  AVX         - Advanced Vector Extensions Supported -->    No

                  AVX OS Support   - AVX Operating System Supported -->        No ---> No Test Required

                  AES         - Advanced Encryption Standard Supported -->    No ---> No Test Required

                  PCLMULQDQ     - Polys Carry-Less Multiply Supported -->    No ---> No Test Required

                      --- AVX AES PCLMULQDQ capabilities check complete ---

                  AVX Compare Test Result --- Not Tested

                  AES Test Result --- Not Tested

                  PCLMULQDQ Test Result --- Not Tested

                  No AVX AES PCLMULQDQ Tests required

                   

                  End Time: Fri Mar 25 12:43:19 2016

                  Total Time:  seconds: 0

                  --------------------------------------------------------------------

                  IMC Test

                  Module Version: 1.0.7.64b.W

                  Start Time: Fri Mar 25 12:43:19 2016

                  Test Result - PASS

                  --- Reading Memory Size ---

                  Detected Memory Size is --> 12.00GB

                  --- Subtest - Memory Size Test Passed!!!  ---

                  --- Integrated Memory Controller Stress Test ---

                  Memory to be allocated = 1048576 byte

                  Memory Allocated.

                  Test 1 Ones and Zeros Moving Inversions write operations - Passed

                  Test 1 Ones and Zeros Moving Inversions verification operations - Passed

                  Test 2 32Bits Sliding Ones write operations - Passed

                  Test 2 32Bits Sliding Ones verification operations - Passed

                  Test 3 32Bits Sliding Zero write operations - Passed

                  Test 3 32Bits Sliding Zero verification operations - Passed

                  Memory Deallocated.

                  --- Subtest - Memory Stress Test Passed!!!  ---

                  Integrated Memory Controller Stress Test Passed!!!

                  End Time: Fri Mar 25 12:43:19 2016

                  Total Time:  seconds: 0

                  --------------------------------------------------------------------

                  PCH Test

                  Module Version: 1.0.9.64b.W

                  Start Time: Fri Mar 25 12:43:19 2016

                  Test Result - Config Mismatch

                  Platform Controller Hub Test not supported current chipset.

                  Skipping Platform Controller Hub Test.

                  End Time: Fri Mar 25 12:43:20 2016

                  Total Time:  seconds: 1

                  --------------------------------------------------------------------

                  IGD Module Test

                  Module Version: 1.0.12.64b.W

                  Start Time: Fri Mar 25 12:43:20 2016

                  Test Result: Intel(R) Integrated Graphics Device Not Detected or Not Configured, Test Skipped

                  End Time: Fri Mar 25 12:43:20 2016

                  Total Time:  seconds: 0

                  --------------------------------------------------------------------

                  GFX Module Test

                  Module Version: 1.0.12.64b.W

                  Start Time: Fri Mar 25 12:43:20 2016

                  GFX Module Test: PASS

                  End Time: Fri Mar 25 12:43:48 2016

                  Total Time:  seconds: 28

                  --------------------------------------------------------------------

                  CPU Load

                  Module Version: 1.0.10.64b.W

                  Start Time: Fri Mar 25 12:43:48 2016

                  CPU Load: PASS

                  End Time: Fri Mar 25 12:47:48 2016

                  Total Time:  seconds: 240

                  --------------------------------------------------------------------

                  --- IPDT64 - Temperature Monitor Results

                   

                  --- Temperature Test ---

                  ...

                  Version 1.0.12.64b.W

                  ...

                   

                  3 degrees C below maximum

                  Test Result - PASS

                  Expected Greater than 1 degrees below max

                  Received 3 degrees below max

                   

                  --- Temperature Test ---

                  ...

                  Version 1.0.12.64b.W

                  ...

                   

                   

                  Entering run forever

                  3 degrees C below maximum

                  Test Result - PASS

                  Expected Greater than 1 degrees below max

                  Received 3 degrees below max

                  Test PASSED

                  3 degrees C below maximum

                  Test Result - PASS

                  Expected Greater than 1 degrees below max

                  Received 3 degrees below max

                  Test PASSED

                  2 degrees C below maximum

                  Test Result - PASS

                  Expected Greater than 1 degrees below max

                  Received 2 degrees below max

                  Test PASSED

                  3 degrees C below maximum

                  Test Result - PASS

                  Expected Greater than 1 degrees below max

                  Received 3 degrees below max

                  Test PASSED

                  2 degrees C below maximum

                  Test Result - PASS

                  Expected Greater than 1 degrees below max

                  Received 2 degrees below max

                  Test PASSED

                  2 degrees C below maximum

                  Test Result - PASS

                  Expected Greater than 1 degrees below max

                  Received 2 degrees below max

                  Test PASSED

                  3 degrees C below maximum

                  Test Result - PASS

                  Expected Greater than 1 degrees below max

                  Received 3 degrees below max

                  Test PASSED

                  3 degrees C below maximum

                  Test Result - PASS

                  Expected Greater than 1 degrees below max

                  Received 3 degrees below max

                  Test PASSED

                  2 degrees C below maximum

                  Test Result - PASS

                  Expected Greater than 1 degrees below max

                  Received 2 degrees below max

                  Test PASSED

                  3 degrees C below maximum

                  Test Result - PASS

                  Expected Greater than 1 degrees below max

                  Received 3 degrees below max

                  Test PASSED

                  3 degrees C below maximum

                  Test Result - PASS

                  Expected Greater than 1 degrees below max

                  Received 3 degrees below max

                  Test PASSED

                  3 degrees C below maximum

                  Test Result - PASS

                  Expected Greater than 1 degrees below max

                  Received 3 degrees below max

                  Test PASSED

                  3 degrees C below maximum

                  Test Result - PASS

                  Expected Greater than 1 degrees below max

                  Received 3 degrees below max

                  Test PASSED

                  3 degrees C below maximum

                  Test Result - PASS

                  Expected Greater than 1 degrees below max

                  Received 3 degrees below max

                  Test PASSED

                  3 degrees C below maximum

                  Test Result - PASS

                  Expected Greater than 1 degrees below max

                  Received 3 degrees below max

                  Test PASSED

                  3 degrees C below maximum

                  Test Result - PASS

                  Expected Greater than 1 degrees below max

                  Received 3 degrees below max

                  Test PASSED

                  3 degrees C below maximum

                  Test Result - PASS

                  Expected Greater than 1 degrees below max

                  Received 3 degrees below max

                  Test PASSED

                  2 degrees C below maximum

                  Test Result - PASS

                  Expected Greater than 1 degrees below max

                  Received 2 degrees below max

                  Test PASSED

                  2 degrees C below maximum

                  Test Result - PASS

                  Expected Greater than 1 degrees below max

                  Received 2 degrees below max

                  Test PASSED

                  3 degrees C below maximum

                  Test Result - PASS

                  Expected Greater than 1 degrees below max

                  Received 3 degrees below max

                  Test PASSED

                  3 degrees C below maximum

                  Test Result - PASS

                  Expected Greater than 1 degrees below max

                  Received 3 degrees below max

                  Test PASSED

                  3 degrees C below maximum

                  Test Result - PASS

                  Expected Greater than 1 degrees below max

                  Received 3 degrees below max

                  Test PASSED

                  2 degrees C below maximum

                  Test Result - PASS

                  Expected Greater than 1 degrees below max

                  Received 2 degrees below max

                  Test PASSED

                  2 degrees C below maximum

                  Test Result - PASS

                  Expected Greater than 1 degrees below max

                  Received 2 degrees below max

                  Test PASSED

                  3 degrees C below maximum

                  Test Result - PASS

                  Expected Greater than 1 degrees below max

                  Received 3 degrees below max

                  Test PASSED

                  2 degrees C below maximum

                  Test Result - PASS

                  Expected Greater than 1 degrees below max

                  Received 2 degrees below max

                  Test PASSED

                  3 degrees C below maximum

                  Test Result - PASS

                  Expected Greater than 1 degrees below max

                  Received 3 degrees below max

                  Test PASSED

                  3 degrees C below maximum

                  Test Result - PASS

                  Expected Greater than 1 degrees below max

                  Received 3 degrees below max

                  Test PASSED

                  3 degrees C below maximum

                  Test Result - PASS

                  Expected Greater than 1 degrees below max

                  Received 3 degrees below max

                  Test PASSED

                  3 degrees C below maximum

                  Test Result - PASS

                  Expected Greater than 1 degrees below max

                  Received 3 degrees below max

                  Test PASSED

                  3 degrees C below maximum

                  Test Result - PASS

                  Expected Greater than 1 degrees below max

                  Received 3 degrees below max

                  Test PASSED

                  2 degrees C below maximum

                  Test Result - PASS

                  Expected Greater than 1 degrees below max

                  Received 2 degrees below max

                  Test PASSED

                  2 degrees C below maximum

                  Test Result - PASS

                  Expected Greater than 1 degrees below max

                  Received 2 degrees below max

                  Test PASSED

                  3 degrees C below maximum

                  Test Result - PASS

                  Expected Greater than 1 degrees below max

                  Received 3 degrees below max

                  Test PASSED

                  3 degrees C below maximum

                  Test Result - PASS

                  Expected Greater than 1 degrees below max

                  Received 3 degrees below max

                  Test PASSED

                  2 degrees C below maximum

                  Test Result - PASS

                  Expected Greater than 1 degrees below max

                  Received 2 degrees below max

                  Test PASSED

                  3 degrees C below maximum

                  Test Result - PASS

                  Expected Greater than 1 degrees below max

                  Received 3 degrees below max

                  Test PASSED

                  3 degrees C below maximum

                  Test Result - PASS

                  Expected Greater than 1 degrees below max

                  Received 3 degrees below max

                  Test PASSED

                  3 degrees C below maximum

                  Test Result - PASS

                  Expected Greater than 1 degrees below max

                  Received 3 degrees below max

                  Test PASSED

                  2 degrees C below maximum

                  Test Result - PASS

                  Expected Greater than 1 degrees below max

                  Received 2 degrees below max

                  Test PASSED

                  3 degrees C below maximum

                  Test Result - PASS

                  Expected Greater than 1 degrees below max

                  Received 3 degrees below max

                  Test PASSED

                  3 degrees C below maximum

                  Test Result - PASS

                  Expected Greater than 1 degrees below max

                  Received 3 degrees below max

                  Test PASSED

                   

                  Temperature Monitor Stopped

                   

                  --------------------------------------------------------------------

                   

                  System Information

                  ------------------

                  Processor Name: Intel(R) Core(TM) i7 CPU         950  @ 3.07GHz

                  Processor Information: Intel64 Family 6 Model 26 Stepping 5

                  Number of Physical Cores: 4

                  Number of Logical Cores: 8

                  Installed System Memory: 12 GB

                  Operating System: Microsoft Windows 7 Ultimate 64-bit

                  Graphics Information: NVIDIA GeForce GTX 275

                  System Product: EX58-UD5

                  System BIOS: F13

                  --------------------------------------------------------------------

                   

                  --- IPDT64 - End Time: 3/25/2016 12:47:48 PM

                  --- IPDT64 - Result: Pass

                  --------------------------------------------------------------------

                  • 6. Re: Please check your Processor Thermal Solution
                    Amy_Intel

                    PhilO, note the following, the CPU Frequency is still too high;

                     

                                                  >>Expected CPU Frequency: 3.07

                                                  >>Detected CPU Frequency: 5.43968

                     

                    The highest you are supposed to get with this processor is 3.33 and that value is the max turbo frequency. It seems that something in your motherboard configuration is overclocking the processor. Since you already loaded the defaults and this still persists I would recommend contacting GIGABYTE  - Support in order to obtain more feedback.

                     

                    Here you can check the specifications for Intel® Core™ i7-950 Processor (8M Cache, 3.06 GHz, 4.80 GT/s Intel® QPI) Specifications.

                     

                    Regards,

                    • 7. Re: Please check your Processor Thermal Solution
                      PhilO

                      Well, I just ran the tests again and the detected CPU frequency is only 3.09837 (see test results below).

                      I have not changed a thing in the BIOS.  I am running the same version of your dx tool.  I think there is a bug in your software.

                      Thanks,

                      Phil

                       

                       

                      --- IPDT64 - Revision: 3.0.0.25.W.MP

                      --- IPDT64 - Start Time: 3/31/2016 6:21:54 AM

                       

                      --------------------------------------------------------------------

                      Processor 1

                      --------------------------------------------------------------------

                      Genuine Intel CPU Test

                      Module Version: 1.0.12.64b.W

                      Start Time: Thu Mar 31 06:21:54 2016

                      Test Result - PASS

                      Expected: GenuineIntel

                      Detected: GenuineIntel

                      End Time: Thu Mar 31 06:21:54 2016

                      Total Time:  seconds: 0

                      --------------------------------------------------------------------

                      Temperature Test

                      Module Version: 1.0.12.64b.W

                      Start Time: Thu Mar 31 06:21:54 2016

                      Test Result - PASS

                      Expected: Greater than 1 degrees below max

                      Received: 2 degrees below max

                      End Time: Thu Mar 31 06:21:55 2016

                      Total Time:  seconds: 1

                      --------------------------------------------------------------------

                      CPU Brand String Test

                      Module Version: 1.0.12.64b.W

                      Start Time: Thu Mar 31 06:21:55 2016

                      Test Result - PASS

                      Expected String Parts: As Defined in BrandString_LocalConfig.xml

                      Detected: Intel(R) Core(TM) i7 CPU         950  @ 3.07GHz

                      End Time: Thu Mar 31 06:21:55 2016

                      Total Time:  seconds: 0

                      --------------------------------------------------------------------

                      CPU Frequency Test

                      Module Version: 1.0.14.64b.W

                      Start Time: Thu Mar 31 06:21:55 2016

                      Test Result - PASS

                      Processor Name: Intel(R) Core(TM) i7 CPU         950  @ 3.07GHz

                      Expected CPU Frequency: 3.07

                      Detected CPU Frequency: 3.09837

                      Expected Base Clock: 133.33

                      Detected Base Clock: 134.712

                      QPI link rate Test - Not supported.

                      Skipping QPI link rate Test.

                      End Time: Thu Mar 31 06:21:57 2016

                      Total Time:  seconds: 2

                      --------------------------------------------------------------------

                      Floating Point Test

                      Module Version: 1.0.10.64b.W

                      Start Time: Thu Mar 31 06:21:57 2016

                      Test Result - PASS

                      Million Floating Points per Second, MFLOPS: 331.2

                      Error: 0

                      --- Floating Point Test Passed!!!---

                      End Time: Thu Mar 31 06:21:59 2016

                      Total Time:  seconds: 2

                      --------------------------------------------------------------------

                      Prime Number Generation Test

                      Module Version: 1.0.10.64b.W

                      Start Time: Thu Mar 31 06:21:59 2016

                      Test Result - PASS

                      Operation Per Second: 4.65205e+006

                      Error: 0

                      --- Prime Number Generation Test Passed!!!---

                      End Time: Thu Mar 31 06:22:01 2016

                      Total Time:  seconds: 2

                      --------------------------------------------------------------------

                      Cache Test

                      Module Version: 1.0.10.64b.W

                      Start Time: Thu Mar 31 06:22:01 2016

                      Test Result - PASS

                       

                      --- Reading Cache Size --- 

                       

                      - Detected L1 Data Cache Size --> 32

                      - Detected L1 Inst Cache Size --> 32

                       

                      - Detected L2 Cache Size --> 256

                      - Detected L3 Cache Size --> 8192

                       

                      Cache Size Test Passed!!!

                       

                      End Time: Thu Mar 31 06:22:01 2016

                      Total Time:  seconds: 0

                      --------------------------------------------------------------------

                      MMXSSE Test

                      Module Version: 1.0.10.64b.W

                      Start Time: Thu Mar 31 06:22:01 2016

                      Test Result - PASS

                       

                      --- Determining MMX - SSE capabilities ---

                               --- CPU FEATURES DETECTION FOR ---

                                      ---        MMX SSE       ---

                      MMX         - MMX Supported -->    Yes

                      SSE         - SSE Supported -->    Yes

                      SSE2         - SSE2 Supported -->    Yes

                      SSE3         - SSE3 Supported -->    Yes

                      SSSE3         - SSSE3 Supported -->    Yes

                      SSE4.1         - SSE4.1 Supported -->    Yes

                      SSE4.2         - SSE4.2 Supported -->    Yes

                              --- MMX SSE - capabilities check complete ---

                      MMX Test Result --- PASS

                      SSE Test Result --- PASS

                      SSE2 Test Result --- PASS

                      SSE3 Test Result --- PASS

                      SSSE3 Test Result --- PASS

                      SSE4.1 Test Result --- PASS

                      SSE4.2 Test Result --- PASS

                       

                      End Time: Thu Mar 31 06:22:01 2016

                      Total Time:  seconds: 0

                      --------------------------------------------------------------------

                      AVX Test

                      Module Version: 1.0.11.64b.W

                      Start Time: Thu Mar 31 06:22:01 2016

                      Test Result - PASS

                       

                      --- Determining AVX AES PCLMULQDQ capabilities ---

                               --- CPU FEATURES DETECTION FOR ---

                                     --- AVX/AES/PCLMULQDQ ---

                      AVX         - Advanced Vector Extensions Supported -->    No

                      AVX OS Support   - AVX Operating System Supported -->        No ---> No Test Required

                      AES         - Advanced Encryption Standard Supported -->    No ---> No Test Required

                      PCLMULQDQ     - Polys Carry-Less Multiply Supported -->    No ---> No Test Required

                          --- AVX AES PCLMULQDQ capabilities check complete ---

                      AVX Compare Test Result --- Not Tested

                      AES Test Result --- Not Tested

                      PCLMULQDQ Test Result --- Not Tested

                      No AVX AES PCLMULQDQ Tests required

                       

                      End Time: Thu Mar 31 06:22:01 2016

                      Total Time:  seconds: 0

                      --------------------------------------------------------------------

                      IMC Test

                      Module Version: 1.0.7.64b.W

                      Start Time: Thu Mar 31 06:22:01 2016

                      Test Result - PASS

                      --- Reading Memory Size ---

                      Detected Memory Size is --> 12.00GB

                      --- Subtest - Memory Size Test Passed!!!  ---

                      --- Integrated Memory Controller Stress Test ---

                      Memory to be allocated = 1048576 byte

                      Memory Allocated.

                      Test 1 Ones and Zeros Moving Inversions write operations - Passed

                      Test 1 Ones and Zeros Moving Inversions verification operations - Passed

                      Test 2 32Bits Sliding Ones write operations - Passed

                      Test 2 32Bits Sliding Ones verification operations - Passed

                      Test 3 32Bits Sliding Zero write operations - Passed

                      Test 3 32Bits Sliding Zero verification operations - Passed

                      Memory Deallocated.

                      --- Subtest - Memory Stress Test Passed!!!  ---

                      Integrated Memory Controller Stress Test Passed!!!

                      End Time: Thu Mar 31 06:22:01 2016

                      Total Time:  seconds: 0

                      --------------------------------------------------------------------

                      PCH Test

                      Module Version: 1.0.9.64b.W

                      Start Time: Thu Mar 31 06:22:01 2016

                      Test Result - Config Mismatch

                      Platform Controller Hub Test not supported current chipset.

                      Skipping Platform Controller Hub Test.

                      End Time: Thu Mar 31 06:22:02 2016

                      Total Time:  seconds: 1

                      --------------------------------------------------------------------

                      IGD Module Test

                      Module Version: 1.0.12.64b.W

                      Start Time: Thu Mar 31 06:22:02 2016

                      Test Result: Intel(R) Integrated Graphics Device Not Detected or Not Configured, Test Skipped

                      End Time: Thu Mar 31 06:22:02 2016

                      Total Time:  seconds: 0

                      --------------------------------------------------------------------

                      GFX Module Test

                      Module Version: 1.0.12.64b.W

                      Start Time: Thu Mar 31 06:22:02 2016

                      GFX Module Test: PASS

                      End Time: Thu Mar 31 06:22:30 2016

                      Total Time:  seconds: 28

                      --------------------------------------------------------------------

                      CPU Load

                      Module Version: 1.0.10.64b.W

                      Start Time: Thu Mar 31 06:22:30 2016

                      CPU Load: PASS

                      End Time: Thu Mar 31 06:26:30 2016

                      Total Time:  seconds: 240

                      --------------------------------------------------------------------

                      --- IPDT64 - Temperature Monitor Results

                       

                      --- Temperature Test ---

                      ...

                      Version 1.0.12.64b.W

                      ...

                       

                      0 degrees C below maximum

                      Test Result - FAIL

                      Expected Greater than 1 degrees below max

                      Received 0 degrees below max

                       

                      --- Temperature Test ---

                      ...

                      Version 1.0.12.64b.W

                      ...

                       

                       

                      Entering run forever

                       

                      Temperature Monitor Stopped

                       

                      --------------------------------------------------------------------

                       

                      System Information

                      ------------------

                      Processor Name: Intel(R) Core(TM) i7 CPU         950  @ 3.07GHz

                      Processor Information: Intel64 Family 6 Model 26 Stepping 5

                      Number of Physical Cores: 4

                      Number of Logical Cores: 8

                      Installed System Memory: 12 GB

                      Operating System: Microsoft Windows 7 Ultimate 64-bit

                      Graphics Information: NVIDIA GeForce GTX 275

                      System Product: EX58-UD5

                      System BIOS: F13

                      --------------------------------------------------------------------

                       

                      --- IPDT64 - End Time: 3/31/2016 6:26:30 AM

                      --- IPDT64 - Result: Pass

                      --------------------------------------------------------------------

                      • 8. Re: Please check your Processor Thermal Solution
                        Amy_Intel

                        I have been running some tests with the Intel® Processor Diagnostic Tool and the tool behaves as expected. At this stage, I would recommend contacting GIGABYTE - Support since it looks like something in your motherboard configuration is overclocking the processor.

                         

                        Regards,